program: Gaussian 09
title: 000289619
version: EM64L-G09RevD.01
frameworkgroup: C1[X(C21H21NO3)]
method: RPBEPBE
basis: SDD
operation: Freq
keyword: #p
keyword: freq=noraman
keyword: PBEPBE/SDD
title: #p freq=noraman PBEPBE/SDD
converged: YES YES NO NO
title: Mulliken charges:
elementType: O O O N C C C C C C C C C C C C C C C C C C C C C H H H H H H H H H H H H H H H H H H H H H
charge: -0.284607 -0.417248 -0.247043 -0.383057 -0.592181 -0.551223 -0.078700 -0.515408 0.376969 0.406543 0.381602 0.402160 -0.471344 -0.473791 -0.469590 -0.478362 0.232197 -0.239985 -0.236362 -0.236260 -0.234051 -0.541420 -0.375981 -0.488035 0.186132 0.276219 0.245448 0.298052 0.250423 0.231867 0.307992 0.252710 0.248292 0.243281 0.240976 0.228816 0.226113 0.226482 0.225244 0.228921 0.211687 0.224987 0.233778 0.314814 0.239831 0.373114
chargesum: 0.00000
title: Mulliken charges with hydrogens summed into heavy atoms:
elementType: O O O N C C C C C C C C C C C C C C C C C C C C C
charge: -0.284607 -0.044134 -0.247043 -0.075065 -0.315962 -0.305774 0.219352 -0.033118 0.376969 0.406543 0.381602 0.402160 -0.218635 -0.225498 -0.226310 -0.237386 0.232197 -0.011168 -0.010249 -0.009778 -0.008807 -0.100813 0.082784 0.066610 0.186132
polarizability: 2.65150917e+02 -6.61356305e+00 2.46487345e+02 1.89953435e+01 6.24759635e+00 1.82050574e+02
1716.lowfreq: -13.3053 -0.0008 -0.0007 -0.0003 1.4802 3.2709 9.8565 12.7864 27.4913
frequency: -5.5142 12.0405 27.4713 36.4224 41.7854 63.5938 66.3958 121.7705 130.5039 138.1357 157.9206 170.6936 203.1084 217.1203 241.0991 264.9610 316.1453 347.1768 361.2300 368.0139 398.8397 421.7866 430.1973 447.8993 470.6850 492.1816 507.4724 515.4148 551.0025 556.6414 576.9194 582.0430 592.6675 612.0962 633.8248 642.3371 648.4225 707.6094 722.3976 753.4584 758.0011 763.9422 773.6938 782.2359 791.6595 814.5638 832.9551 843.3660 846.0160 877.9844 887.0484 897.4823 898.9733 907.7762 945.8138 947.0690 952.8641 969.8320 986.0729 987.7182 1012.0367 1022.2783 1024.1856 1026.8790 1046.6771 1063.3678 1074.1861 1084.5623 1106.8520 1117.1132 1154.4700 1159.1407 1169.5155 1171.2586 1171.7247 1172.7958 1181.6903 1194.8294 1201.6588 1210.3882 1216.4922 1219.2613 1243.6011 1254.5366 1269.2442 1284.4912 1287.0710 1304.0853 1309.5345 1321.6513 1331.3065 1338.5265 1353.7684 1378.6438 1392.7728 1395.8587 1443.9312 1450.1049 1451.3580 1457.4415 1460.7244 1463.8201 1474.1688 1480.9832 1482.5538 1592.2512 1596.8731 1599.8485 1612.6565 1621.0969 1661.1780 2977.9317 2989.1333 3000.2858 3003.9528 3042.8129 3051.8549 3051.9256 3053.7567 3068.0597 3068.9095 3074.3517 3119.3927 3119.6426 3126.2023 3127.3316 3140.0705 3140.7487 3160.2332 3160.6805 3509.4968 3540.1509
redmass: 6.0957 8.7750 7.0491 6.7494 5.1976 5.1529 4.9882 2.6455 3.9672 3.8001 3.7208 3.6440 3.9862 3.6132 4.8490 3.7286 3.4271 4.1231 4.0155 4.3000 3.6811 3.5409 4.1155 3.0804 3.0641 4.9913 4.2380 1.9481 3.8842 1.5980 2.3260 3.6109 3.7023 3.9941 5.0036 6.4818 1.4272 3.8835 4.3273 2.4533 2.0336 1.4771 2.7054 2.3182 2.2988 3.1229 2.5029 2.6959 2.6933 1.3768 1.7807 3.6432 3.0914 3.5698 1.4155 1.6093 2.5152 2.7610 1.3193 1.3170 2.7140 2.4476 2.2517 2.1503 3.4782 2.3566 2.4455 2.1558 1.9907 1.7751 1.3507 1.2815 1.6207 2.7600 1.0962 1.1035 1.4673 1.3314 1.5516 1.4420 1.7351 1.6419 1.6016 1.6532 1.8929 1.2163 1.3672 1.3449 1.5322 1.4060 1.4824 1.4354 1.5422 1.7107 6.9642 5.8096 2.3652 1.0880 2.4356 1.1776 1.1841 2.3307 1.1134 1.7048 2.5314 6.2054 6.0981 6.6352 6.9474 7.1157 7.9844 1.0656 1.0598 1.0614 1.0614 1.0975 1.0946 1.0926 1.0904 1.0905 1.1001 1.0972 1.0860 1.0860 1.0895 1.0892 1.0941 1.0942 1.1003 1.1003 1.0638 1.0777
irintensity: 0.2584 2.5169 0.3951 5.4963 1.3781 2.4468 0.7326 0.0123 2.3506 0.8866 4.5079 2.8779 0.7298 8.9150 3.6071 2.4885 0.9993 2.0732 11.2841 0.2014 5.3154 15.1048 16.5341 4.2420 5.3733 1.3398 6.1647 33.7067 27.2944 31.4951 54.3141 5.6918 29.6556 4.0620 6.3206 1.8406 120.8365 7.0662 8.6193 5.5477 12.2714 72.1991 20.0839 5.9890 36.9905 1.9886 2.8901 2.0815 0.8854 0.4881 2.2178 15.6786 1.7342 14.6761 0.2897 3.8414 1.4437 9.6898 0.0162 0.0240 73.4327 7.4756 14.1288 77.1049 50.8395 10.1457 93.5049 2.4293 9.2462 13.4668 12.8389 13.7996 2.1854 2.2306 0.1675 1.1696 40.3427 42.5027 13.3994 2.6375 9.0057 7.7982 6.8865 3.1121 24.7136 9.7190 33.3832 10.2939 12.5543 2.0052 4.8031 15.3204 55.0257 60.6069 0.0800 0.6322 11.9905 25.1827 0.6039 43.5293 51.9591 38.1352 27.9211 239.5696 12.7199 5.2295 99.8373 53.8484 0.0112 0.0862 206.0048 62.6135 14.0453 21.0143 36.6763 14.7268 4.9339 48.0516 1.1641 17.1988 30.2578 25.0800 0.2828 7.8914 2.8031 2.5529 16.3897 40.6542 52.6942 18.2763 20.2266 15.1270
temp: 298.150 k
press: 1.00000 atm
elementType: 8 8 8 7 6 6 6 6 6 6 6 6 6 6 6 6 6 6 6 6 6 6 6 6 6 1 1 1 1 1 1 1 1 1 1 1 1 1 1 1 1 1 1 1 1 1
symmnumber: 1
zpe: 978885.8 jmol-1
zpe.correction: 0.372838 hartree
zpe.thermalcorrener: 0.393357 hartree
zpe.thermalcorrenthalpy: 0.394301 hartree
zpe.thermalcorrgfe: 0.321139 hartree
zpe.sumelectzpe: -1091.515724 hartree
zpe.sumelectthermal: -1091.495204 hartree
zpe.sumelectthermalent: -1091.494260 hartree
zpe.sumelectthermalfe: -1091.567422 hartree
dipole: 1.6977 2.3948 2.0616
dipole: 3.5871
quadrupole: -136.8678 -142.9571 -143.2260
quadrupole: -2.3603 3.9432 11.3256
quadrupole: 4.1492 -1.9401 -2.2090 -2.3603 3.9432 11.3256
hfenergy: -1091.8885617 hartree
pointgroup: C01 [X(C21H21N1O3)]
dipole: -0.3758678 -0.3724987 1.3083176 debye
polarizability: 266.7166573|-11.5529138|211.0624786|-13.6494736|-32.7789672|215.9097006 unknown
InChI: InChI=1S/C21H21NO3/c23-19(10-5-11-20(24)25)22-18-12-17-13-6-1-3-8-15(13)21(18)16-9-4-2-7-14(16)17/h1-4,6-9,17-18,21-22,24H,5,10-12H2
charge 0 multiplicity 1
46 atoms
O  1.666523 2.435036 -0.278135
O  6.01622 1.900324 -2.830023
O  5.246475 -0.231259 -2.336739
N  0.799406 0.940083 1.274642
C  -0.88411 -0.01808 -0.351157
C  -2.622542 -0.291019 1.592275
C  -0.583791 1.053133 0.78321
C  -1.621576 0.875953 1.941128
C  -0.820573 -1.385199 0.32154
C  -2.321904 0.233636 -0.792408
C  -1.766888 -1.536924 1.373707
C  -3.267486 0.079131 0.25762
C  0.072736 -2.429494 0.013691
C  -2.746599 0.601286 -2.08298
C  -1.823831 -2.73569 2.110124
C  -4.638579 0.284422 0.016325
C  1.849272 1.625229 0.689656
C  0.011617 -3.639292 0.750586
C  -4.127494 0.806419 -2.328506
C  -0.932803 -3.791952 1.792704
C  -5.068811 0.647329 -1.284967
C  3.236927 1.337753 1.269485
C  4.189642 0.698149 0.221399
C  4.5883 1.67903 -0.901528
C  5.287878 0.987071 -2.048484
H  -0.15787 0.098364 -1.172056
H  -3.363964 -0.422946 2.398726
H  -0.664884 2.051597 0.322064
H  -2.184712 1.812637 2.093039
H  -1.104158 0.643224 2.890449
H  0.999461 0.236102 1.987968
H  0.803435 -2.310538 -0.794904
H  -2.015707 0.727713 -2.890001
H  -2.55428 -2.854332 2.919249
H  -5.368551 0.163022 0.825461
H  0.696176 -4.46024 0.509671
H  -4.467691 1.087932 -3.331316
H  -0.977299 -4.73158 2.354832
H  -6.134931 0.80446 -1.483856
H  3.664469 2.297653 1.61744
H  3.162182 0.672632 2.150669
H  5.098792 0.341728 0.741632
H  3.7165 -0.19546 -0.226463
H  3.676629 2.173002 -1.295661
H  5.234242 2.493063 -0.525724
H  6.422952 1.413791 -3.598182
