program: Gaussian 09
title: 000027797
version: EM64L-G09RevD.01
frameworkgroup: C1[X(C17H24N2O)]
method: RPBEPBE
basis: SDD
operation: Freq
keyword: #p
keyword: freq=noraman
keyword: PBEPBE/SDD
title: #p freq=noraman PBEPBE/SDD
converged: YES YES NO NO
title: Mulliken charges:
elementType: O N N C C C C C C C C C C C C C C C C C H H H H H H H H H H H H H H H H H H H H H H H H
charge: -0.244354 -0.107427 0.011124 0.312665 -0.360984 -0.361412 -0.395078 -0.402953 -0.402332 -0.766785 -0.754095 -0.030754 0.338320 -0.373611 -0.387990 0.090316 -0.244124 -0.250942 -0.232865 -0.750089 0.166346 0.219239 0.217315 0.163644 0.189786 0.208263 0.208116 0.188141 0.215368 0.187870 0.229393 0.212610 0.264592 0.219802 0.233901 0.223883 0.285979 0.242980 0.235559 0.230120 0.233131 0.236981 0.247189 0.253160
chargesum: 0.00000
title: Mulliken charges with hydrogens summed into heavy atoms:
elementType: O N N C C C C C C C C C C C C C C C C C
charge: -0.244354 -0.107427 0.011124 0.312665 0.024601 0.019547 0.002971 -0.006696 0.000906 -0.060190 -0.076509 -0.030754 0.338320 -0.087632 -0.145010 0.090316 -0.008564 -0.020822 0.000266 -0.012759
polarizability: 2.37267827e+02 4.40619696e+00 1.87868153e+02 -1.64131012e+00 1.21967842e+01 1.68084005e+02
1716.lowfreq: -18.0101 -0.0007 -0.0005 -0.0002 1.6325 7.6337 17.5767 39.7904 45.8792
frequency: 16.9359 38.5232 45.7493 50.4871 68.8172 77.8510 91.6293 102.9514 128.6997 151.1560 180.1372 208.5449 223.6548 237.4656 247.4794 258.9185 276.9911 301.0273 314.0182 328.8773 368.3145 376.3845 406.2564 422.1441 444.8825 449.0780 461.3285 516.1332 535.8788 568.8159 588.3814 614.2140 619.4498 675.5011 696.6127 709.3515 718.4942 778.0862 809.4552 829.4674 845.1425 856.5924 859.7568 885.2399 912.1707 921.7226 923.1568 943.5229 958.7575 959.8795 980.6041 985.0851 988.7757 996.6066 1001.4230 1029.8910 1033.2336 1035.7027 1072.5876 1079.9007 1086.0226 1123.1870 1132.7193 1148.5930 1155.6350 1173.2221 1175.0846 1182.3814 1197.1678 1224.1153 1242.2254 1254.0705 1262.2167 1270.5132 1294.2513 1323.8533 1331.0879 1340.2586 1347.2390 1349.6597 1366.5684 1368.8828 1371.0048 1375.1604 1390.7109 1431.1560 1444.4760 1450.5752 1454.6358 1458.0806 1459.5213 1461.4136 1464.1024 1469.0012 1474.0723 1479.1770 1481.8638 1489.4899 1567.6471 1579.9151 1606.4920 1663.8487 2819.0437 2833.7008 2965.5559 2983.6065 2986.6052 2987.7612 2988.8498 2990.8094 3020.1149 3033.5299 3045.3089 3054.4943 3065.2186 3077.4573 3080.5684 3082.9991 3092.1642 3112.1764 3127.2909 3128.7802 3137.3223 3149.4188 3157.7481 3168.7564
redmass: 4.2077 2.9120 3.8824 3.0373 3.2958 1.9670 1.9377 3.1945 4.5318 4.1331 4.1699 2.5451 1.7313 1.6102 2.6034 2.5459 1.5177 2.3136 1.9909 2.2993 1.9446 3.9431 2.8624 3.0608 3.0958 2.9693 2.6323 2.3722 2.9909 3.5606 5.2767 6.0234 3.0371 4.4704 5.7415 1.8727 2.3521 2.3176 1.4677 4.1384 3.0579 1.4353 1.2554 2.9899 1.5826 2.1006 2.0258 2.0059 1.6589 1.7171 1.5574 1.7288 4.1535 1.3186 1.3634 2.1680 1.7994 2.1149 1.9410 1.4957 1.6371 2.7682 2.0813 1.2714 2.6157 2.2372 1.1417 2.5888 1.1417 3.4937 3.3226 2.7510 1.4142 1.1905 1.3730 1.4045 1.2760 1.4072 1.4695 1.4407 1.2373 1.3007 3.9871 1.3777 1.2016 2.2549 1.1046 1.0906 1.0483 1.0594 1.0876 1.0843 1.0773 1.0867 1.0887 2.0061 1.0537 1.0749 7.0269 5.7304 5.8756 12.3466 1.0709 1.0700 1.0628 1.0613 1.0604 1.0359 1.0372 1.0357 1.0863 1.0960 1.1033 1.1024 1.0894 1.0987 1.0958 1.0976 1.0995 1.1010 1.0849 1.1008 1.0882 1.0927 1.0963 1.1014
irintensity: 0.4291 0.3852 0.7577 1.4002 2.3434 1.9107 3.0067 2.9388 0.1312 2.6033 0.2935 1.7999 0.9829 0.9075 0.6172 0.2300 0.0915 0.5298 0.1359 2.6836 1.9823 5.1224 0.5441 0.6057 6.0698 0.6824 2.1523 2.2819 3.4745 0.2974 26.3585 3.7391 8.7535 10.3984 4.8229 72.8915 16.7203 21.3109 0.0147 2.2037 0.7379 8.7331 0.5135 14.7912 5.5245 7.5746 30.8510 31.5338 8.5371 15.8194 3.1702 5.2906 2.7861 0.3928 1.9363 6.9752 10.2838 3.3311 7.7954 5.3613 7.7033 6.0929 6.9871 7.6495 8.8459 1.0331 3.4226 86.4313 4.6534 91.6990 158.0226 9.8959 0.1629 16.8883 2.0107 1.3989 3.7141 0.1620 1.8269 0.6067 44.8507 21.7723 4.1522 4.3511 16.7613 8.4345 37.8444 6.4564 17.3183 1.2853 13.5667 6.4025 6.0665 1.2936 6.6904 11.3899 13.7459 19.3494 182.0843 1.5868 1.1235 211.3771 45.8265 140.5796 38.6797 33.6721 48.9681 9.5391 4.4911 22.7338 76.0504 60.5356 21.7601 74.8107 31.7681 1.2492 10.5092 81.1826 23.4081 13.4506 0.2575 10.9857 5.6143 23.4059 15.5361 18.9953
temp: 298.150 k
press: 1.00000 atm
elementType: 8 7 7 6 6 6 6 6 6 6 6 6 6 6 6 6 6 6 6 6 1 1 1 1 1 1 1 1 1 1 1 1 1 1 1 1 1 1 1 1 1 1 1 1
symmnumber: 1
zpe: 982244.6 jmol-1
zpe.correction: 0.374117 hartree
zpe.thermalcorrener: 0.394668 hartree
zpe.thermalcorrenthalpy: 0.395612 hartree
zpe.thermalcorrgfe: 0.323818 hartree
zpe.sumelectzpe: -845.389152 hartree
zpe.sumelectthermal: -845.368601 hartree
zpe.sumelectthermalent: -845.367656 hartree
zpe.sumelectthermalfe: -845.439451 hartree
dipole: 1.2555 -3.8838 -2.1426
dipole: 4.6099
quadrupole: -114.3569 -128.1665 -117.3781
quadrupole: 8.2352 4.0877 -4.7258
quadrupole: 5.6103 -8.1993 2.5890 8.2352 4.0877 -4.7258
hfenergy: -845.7632687 hartree
pointgroup: C01 [X(C17H24N2O1)]
dipole: -0.5142652 -1.5461937 0.7963669 debye
polarizability: 236.6010339|-6.4474643|189.2707599|-5.1624615|-10.934096|167.3481915 unknown
InChI: InChI=1S/C17H24N2O/c1-14(20)18-16(15-10-6-4-7-11-15)17(2,3)19-12-8-5-9-13-19/h4,6-7,10-11H,5,8-9,12-13H2,1-3H3
charge 0 multiplicity 1
44 atoms
O  2.05996 2.943961 -0.81285
N  -2.065709 -0.1630 -0.250369
N  0.328331 1.452282 -0.347063
C  -0.857642 -0.565708 -1.0514
C  -3.380108 -0.531545 -0.832146
C  -1.996493 -0.524357 1.186467
C  -4.524581 0.197888 -0.094158
C  -3.096788 0.200625 1.990867
C  -4.495095 -0.119217 1.417147
C  -0.956048 0.006694 -2.49836
C  -0.680933 -2.110565 -1.154707
C  0.392826 0.158132 -0.442736
C  1.659025 -0.584228 -0.105758
C  2.870372 -0.214318 -0.755171
C  1.691504 -1.602919 0.884488
C  1.237333 2.445955 0.014586
C  4.078713 -0.87145 -0.437082
C  2.906035 -2.24156 1.2142
C  4.101901 -1.885866 0.547373
C  1.055583 2.974688 1.433482
H  -3.568106 -1.6365 -0.773732
H  -3.398952 -0.247697 -1.896977
H  -1.005248 -0.230827 1.579398
H  -2.108689 -1.629723 1.348202
H  -5.49363 -0.102016 -0.538445
H  -4.404443 1.287487 -0.246534
H  -2.914068 1.290964 1.934063
H  -3.031328 -0.099532 3.054952
H  -5.275531 0.45441 1.951879
H  -4.720527 -1.195131 1.57259
H  0.017642 -0.091588 -3.011569
H  -1.701203 -0.540974 -3.10115
H  -1.219221 1.075945 -2.454179
H  -0.651142 -2.608181 -0.171179
H  0.245448 -2.375392 -1.693555
H  -1.533031 -2.53111 -1.718669
H  2.858913 0.589703 -1.49831
H  0.774969 -1.880892 1.415286
H  5.001806 -0.582648 -0.95118
H  2.919094 -3.015848 1.989248
H  5.041982 -2.390121 0.797226
H  1.392399 2.214217 2.163603
H  -0.007853 3.18938 1.636613
H  1.655933 3.888081 1.562008
