program: Gaussian 09
title: 000027749
version: EM64L-G09RevD.01
frameworkgroup: C1[X(C15H22O2)]
method: RPBEPBE
basis: SDD
operation: Freq
keyword: #pfreq=noraman
keyword: PBEPBE/SDD
title: #p freq=noraman PBEPBE/SDD
converged: YES YES NO NO
title: Mulliken charges:
elementType: O O C C C C C C C C C C C C C C C H H H H H H H H H H H H H H H H H H H H H H
charge: -0.422269 -0.225314 0.267393 -0.174828 -0.627688 0.256339 -0.536185 0.275886 -0.310136 -0.448768 0.183663 -0.583351 -0.502342 -0.787993 -0.763643 0.139842 -0.882162 0.215344 0.234737 0.224889 0.223102 0.222843 0.265533 0.214823 0.212995 0.220313 0.259116 0.225960 0.232812 0.215195 0.218782 0.220756 0.210922 0.232156 0.207784 0.234774 0.248001 0.230294 0.370427
chargesum: 0.00000
title: Mulliken charges with hydrogens summed into heavy atoms:
elementType: O O C C C C C C C C C C C C C C C
charge: -0.051842 -0.225314 0.267393 0.040516 -0.168062 0.256339 -0.090240 0.275886 -0.044603 -0.020951 0.183663 -0.103922 -0.043570 -0.133259 -0.112781 0.139842 -0.169093
polarizability: 1.78289261e+02 -3.01001509e+00 1.52313811e+02 -5.87632158e+00 1.29753397e+00 1.41083635e+02
1716.lowfreq: -15.2717 -7.4146 -0.0001 0.0003 0.0004 10.5176 49.0902 55.8298 73.2621
frequency: 49.0287 55.7225 73.2447 102.8841 130.2219 151.4029 174.5454 194.9308 218.9271 244.5654 262.2562 267.1524 278.5567 309.7332 323.4037 343.5055 368.8341 377.9306 407.5669 441.5889 450.2262 492.4372 499.4673 533.6932 569.7308 604.5154 611.7470 652.2426 696.5955 719.5808 755.5027 770.0466 796.2747 813.1007 840.3920 863.2669 885.2027 902.5988 924.5848 933.5490 941.9836 972.5151 981.3485 991.0167 995.7280 1020.8005 1024.8247 1041.2484 1049.3365 1059.5172 1077.9263 1092.0510 1103.6173 1114.8064 1141.5702 1150.3417 1157.5443 1164.9483 1185.9669 1194.3416 1198.4049 1221.8465 1228.3934 1241.4829 1258.3104 1281.5514 1283.0547 1293.7395 1302.3004 1310.4350 1315.2984 1327.1593 1358.6719 1374.4653 1389.7410 1400.7037 1451.2628 1458.6939 1464.5671 1467.2778 1469.7328 1471.7379 1476.4004 1480.6375 1485.9117 1487.6707 1500.8822 1653.8687 1688.2541 2966.9608 2972.0436 2976.3607 2978.5177 2988.5278 2993.1761 3002.8694 3009.0991 3020.9615 3033.2065 3039.6817 3049.4272 3052.7565 3061.9840 3066.7476 3069.3405 3075.4163 3079.7381 3083.3087 3084.8827 3088.4331 3501.8877
redmass: 10.7404 3.7221 3.3999 3.6688 1.2129 2.2494 1.3634 1.7731 1.9225 1.6508 1.9070 2.3420 2.8971 2.4048 2.8542 2.3848 4.1717 2.6943 2.9986 3.1271 2.9099 3.2473 2.8685 2.7770 2.7682 2.0435 2.2241 2.5770 3.5544 3.3915 3.3192 3.0354 1.6440 2.4442 2.6039 2.0808 2.7265 2.3261 1.5713 2.5634 2.0163 1.9210 1.7454 2.0884 1.3121 2.5780 1.6506 2.2916 1.8192 1.8915 1.9260 2.1038 1.7686 2.2552 1.9849 2.2021 1.6280 1.3818 2.0879 1.6247 2.1358 1.5876 1.4151 1.5368 1.3789 2.0558 1.6342 1.5157 1.6591 1.5391 1.7699 1.5258 1.7753 1.1871 1.2327 1.1954 1.0795 1.0597 1.0705 1.0661 1.0860 1.0676 1.0680 1.0810 1.0550 1.0629 1.0695 7.8726 9.3610 1.0384 1.0359 1.0368 1.0630 1.0591 1.0719 1.0683 1.0659 1.0738 1.0963 1.0998 1.0977 1.0863 1.0985 1.0986 1.1005 1.1001 1.1028 1.0990 1.0983 1.0960 1.0638
irintensity: 1.1780 0.0883 0.1476 0.0805 0.5599 0.6705 1.2393 0.5393 0.9788 0.3567 0.0097 0.2308 0.7762 0.1296 0.2777 0.4905 6.7131 0.9611 3.4474 7.5950 1.8704 1.0086 1.2395 5.6526 31.2065 37.0745 42.3051 52.7709 21.4023 0.8355 3.0264 0.3766 3.3290 2.9084 0.5323 14.7031 2.5670 0.9634 2.0037 10.8020 5.3124 0.8722 2.1334 18.9963 0.1318 91.1673 7.1080 11.3949 3.7590 166.9551 21.0351 4.1703 16.3268 3.0319 3.6387 3.5070 1.6650 5.2585 3.5563 1.4045 5.8633 3.8179 1.2202 0.5743 4.1177 6.6340 1.5628 4.1979 0.7059 5.6313 4.3425 2.1069 39.3791 16.9562 14.5288 20.1399 10.8938 3.4079 9.0230 6.0652 14.7210 1.7277 21.5637 2.2491 5.9367 16.8225 4.0960 171.8748 2.1224 32.9628 24.1953 52.2095 30.6449 23.6795 32.8320 40.7339 31.2449 77.5286 26.1521 13.4097 15.7412 18.9564 2.4879 45.2510 32.5948 50.5047 23.5352 70.3979 6.4035 34.7813 19.0584
temp: 298.150 k
press: 1.00000 atm
elementType: 8 8 6 6 6 6 6 6 6 6 6 6 6 6 6 6 6 1 1 1 1 1 1 1 1 1 1 1 1 1 1 1 1 1 1 1 1 1 1
symmnumber: 1
zpe: 885774.7 jmol-1
zpe.correction: 0.337374 hartree
zpe.thermalcorrener: 0.353949 hartree
zpe.thermalcorrenthalpy: 0.354893 hartree
zpe.thermalcorrgfe: 0.294591 hartree
zpe.sumelectzpe: -733.934011 hartree
zpe.sumelectthermal: -733.917436 hartree
zpe.sumelectthermalent: -733.916492 hartree
zpe.sumelectthermalfe: -733.976794 hartree
dipole: -0.7194 -1.1218 -0.8348
dipole: 1.5725
quadrupole: -101.9676 -103.7266 -100.7800
quadrupole: -3.5479 -0.9873 -4.4410
quadrupole: 0.1905 -1.5685 1.3780 -3.5479 -0.9873 -4.4410
hfenergy: -734.271385 hartree
pointgroup: C01 [X(C15H22O2)]
dipole: 0.2935764 -0.4495244 0.3074132 debye
polarizability: 178.0911538|3.7706895|152.5454763|-5.9078133|-0.9362817|141.0500765 unknown
InChI: InChI=1S/C15H22O2/c1-9-11-4-5-12(13(16)17)15(11)7-6-10(8-15)14(9,2)3/h10,12,16H,4-8H2,1-3H3
charge 0 multiplicity 1
39 atoms
O  -3.239583 -1.319429 -1.232244
O  -2.826129 0.953535 -1.424138
C  -0.557296 -0.544396 0.50196
C  1.485074 -1.460742 -0.275585
C  -0.014886 -1.385113 -0.676393
C  2.196308 -0.082191 -0.543843
C  0.003642 -1.332546 1.734101
C  0.069722 0.859107 0.458534
C  -2.097745 -0.268873 0.617405
C  1.388963 -1.866009 1.235392
C  1.329556 1.085151 -0.010413
C  -0.939978 1.886867 0.972829
C  -2.160493 1.046366 1.446308
C  3.607729 -0.06602 0.116299
C  2.409055 0.073156 -2.084095
C  -2.732754 -0.09735 -0.749374
C  1.923788 2.483179 -0.052338
H  2.03031 -2.232396 -0.852931
H  -0.190455 -0.911415 -1.657002
H  -0.472243 -2.393113 -0.692398
H  -0.676595 -2.168899 1.988926
H  0.097147 -0.68976 2.627009
H  -2.603566 -1.115585 1.112134
H  2.22437 -1.46751 1.833202
H  1.42784 -2.967356 1.326119
H  -0.537332 2.519235 1.786094
H  -1.247902 2.560885 0.15134
H  -2.059944 0.78879 2.516751
H  -3.114158 1.585199 1.314561
H  4.166659 -0.983408 -0.151119
H  4.197421 0.799364 -0.236681
H  3.556138 -0.004965 1.217662
H  3.039148 -0.752511 -2.46739
H  1.451365 0.059721 -2.632576
H  2.921391 1.021595 -2.326852
H  2.803274 2.574477 0.614926
H  1.190109 3.245703 0.256711
H  2.270362 2.749287 -1.069563
H  -3.619312 -1.172629 -2.141726
