program: Gaussian 09
title: 000289518
version: EM64L-G09RevD.01
frameworkgroup: C1[X(C18H24O2)]
method: RPBEPBE
basis: SDD
operation: Freq
keyword: #pfreq=noraman
keyword: PBEPBE/SDD
title: #p freq=noraman PBEPBE/SDD
converged: YES YES NO NO
title: Mulliken charges:
elementType: O O C C C C C C C C C C C C C C C C C C H H H H H H H H H H H H H H H H H H H H H H H H
charge: -0.438567 -0.278955 0.385780 -0.329372 -0.518409 -0.646767 0.394703 -0.504856 -0.565545 -0.478660 0.155919 0.434612 -0.413718 -0.491969 0.155429 -0.834735 0.158449 -0.399135 -0.825311 -0.535043 0.226410 0.238728 0.221075 0.211831 0.212093 0.238386 0.219539 0.219398 0.246273 0.193644 0.255181 0.212834 0.236057 0.221831 0.228568 0.217383 0.343185 0.236125 0.222414 0.221972 0.274738 0.241159 0.218760 0.218564
chargesum: 0.00000
title: Mulliken charges with hydrogens summed into heavy atoms:
elementType: O O C C C C C C C C C C C C C C C C C C
charge: -0.095382 -0.278955 0.385780 -0.102962 -0.058605 -0.222843 0.394703 -0.046931 -0.099874 -0.029835 0.155919 0.434612 -0.200883 -0.255912 0.155429 -0.166953 0.158449 -0.163010 -0.106188 0.143440
polarizability: 2.68878636e+02 7.99774748e+00 1.78594755e+02 -1.07144206e-02 -1.44756370e+01 1.46689003e+02
1716.lowfreq: -0.0010 -0.0009 -0.0007 1.3916 11.0650 15.2620 43.5591 54.3089 70.9032
frequency: 43.5382 54.2909 70.8981 90.5068 99.8020 112.5564 136.4478 147.7361 162.6688 182.3038 192.1249 220.6832 247.8568 253.3493 259.7847 271.7726 276.9519 298.5243 319.6346 320.8265 353.7896 366.0815 391.5105 421.8434 430.5638 453.8834 492.1582 500.2274 514.0673 545.4113 585.7160 606.9612 623.8326 633.0352 666.8395 713.6668 749.7369 779.3272 799.9971 805.9499 825.1906 838.4951 863.9413 887.5517 905.9290 926.7258 954.2215 961.9066 973.3165 977.3527 984.2670 1019.8970 1025.1145 1030.6048 1037.3703 1042.5032 1078.6217 1079.2365 1100.3591 1112.9939 1122.8370 1146.3624 1151.4474 1160.9511 1181.3225 1186.0921 1190.2481 1210.6112 1214.0428 1233.7814 1234.2078 1248.9759 1277.4132 1289.6075 1297.3649 1315.6253 1323.8684 1330.8427 1334.2817 1355.5181 1360.6804 1374.9482 1381.6986 1394.6934 1395.7252 1428.5224 1434.2097 1449.6007 1455.9381 1457.8271 1462.3227 1463.8594 1467.2985 1471.7309 1475.6935 1478.4033 1479.5433 1482.1152 1485.2396 1589.3073 1607.2643 1705.6153 2908.4217 2938.1997 2950.2793 2954.5107 2954.8693 2955.0853 2958.3905 2967.3523 2971.4309 2990.3473 3004.7326 3007.4226 3024.2453 3038.8567 3040.6528 3047.8982 3075.8723 3092.4829 3092.8304 3111.7855 3118.1849 3118.5459 3161.0042 3567.4744
redmass: 3.9704 3.3911 3.5027 3.1242 3.5645 1.0451 2.8627 3.1483 3.2898 1.2136 2.8822 2.6181 1.9232 1.6409 2.2556 2.8085 2.1199 1.8109 2.4334 1.8172 4.2234 3.3729 2.2968 3.1636 2.6584 3.5198 4.2925 3.8229 4.1146 3.8394 3.7079 3.1985 3.3224 3.7855 4.7654 2.6349 2.8178 2.9108 1.5974 1.5812 3.0627 2.5144 2.3536 1.9641 1.7816 1.3889 2.1280 2.5524 1.9818 2.5514 2.9004 2.4071 2.3969 2.2257 1.5524 1.5742 2.0619 2.0656 1.8018 1.2607 1.8552 1.6342 1.9987 1.6797 1.3579 1.4295 1.3107 2.3032 1.5231 1.8111 1.7025 2.4273 1.7804 1.5105 1.3620 1.4890 1.5080 1.5154 1.4227 2.2062 1.9078 1.2424 3.3189 1.2242 1.2420 2.2150 1.4939 1.3061 1.0783 1.1130 1.0747 1.1603 1.0502 1.0670 1.1026 1.0831 1.0915 1.2582 1.3219 7.3138 6.9590 6.6356 1.0639 1.0715 1.0776 1.0613 1.0365 1.0377 1.0675 1.0920 1.0406 1.0663 1.0963 1.0878 1.0966 1.0968 1.1035 1.1023 1.0979 1.0920 1.0909 1.0891 1.0980 1.0963 1.0932 1.0659
irintensity: 0.9270 0.3810 0.3138 3.3677 2.9909 0.4223 5.3510 1.2664 0.9712 0.6710 1.8414 2.5432 2.2747 1.1139 3.4749 1.5355 21.1871 48.7182 37.0695 49.3573 0.5430 7.1155 9.3673 2.8522 3.6208 1.4147 4.5129 1.0680 3.5295 3.4571 7.1478 1.7694 4.6411 4.5590 7.6523 4.1069 1.3804 5.9112 13.3605 41.3680 1.9847 4.1942 1.1820 2.6518 30.3362 0.1542 9.4377 16.1679 10.4137 57.8999 22.0843 24.8941 3.7864 0.3659 2.6147 20.0130 12.5823 24.4182 97.2495 0.0941 1.0759 4.9132 1.1382 6.4582 13.0272 4.2243 23.2978 20.3158 8.3935 33.9410 19.2099 80.9448 6.9068 0.1790 8.5373 2.0956 7.5711 1.3857 7.3904 2.9649 0.0246 10.7905 7.5278 15.8756 11.7509 5.6546 16.6877 8.4019 6.4662 4.7344 16.7472 18.3715 11.3824 9.6972 75.8909 18.8477 5.3627 26.6382 39.3915 7.2592 29.7399 2.0876 50.2458 34.5866 18.5827 38.6202 118.8087 9.0687 51.8960 28.5609 29.7112 19.8191 31.6300 40.2894 28.9779 14.7504 57.3130 21.8141 24.0262 44.1615 32.5180 20.4732 30.9232 0.2647 18.0851 3.7960
temp: 298.150 k
press: 1.00000 atm
elementType: 8 8 6 6 6 6 6 6 6 6 6 6 6 6 6 6 6 6 6 6 1 1 1 1 1 1 1 1 1 1 1 1 1 1 1 1 1 1 1 1 1 1 1 1
symmnumber: 1
zpe: 986805.3 jmol-1
zpe.correction: 0.375854 hartree
zpe.thermalcorrener: 0.395691 hartree
zpe.thermalcorrenthalpy: 0.396635 hartree
zpe.thermalcorrgfe: 0.329000 hartree
zpe.sumelectzpe: -849.228765 hartree
zpe.sumelectthermal: -849.208928 hartree
zpe.sumelectthermalent: -849.207984 hartree
zpe.sumelectthermalfe: -849.275620 hartree
dipole: 0.3993 -2.2718 0.4948
dipole: 2.3591
quadrupole: -101.6526 -124.4832 -119.8164
quadrupole: 5.8177 -2.4028 -5.5836
quadrupole: 13.6648 -9.1658 -4.4990 5.8177 -2.4028 -5.5836
hfenergy: -849.6046192 hartree
pointgroup: C01 [X(C18H24O2)]
dipole: -0.1507761 0.8661909 0.2973755 debye
polarizability: 269.0032243|6.663738|174.5761535|2.5418593|17.887726|150.5830154 unknown
InChI: InChI=1S/C18H24O2/c1-12-4-6-16-15-5-7-17(20-3)13(2)14(15)8-9-18(16,10-12)11-19/h4-5,7,16,19H,6,8-11H2,1-3H3
charge 0 multiplicity 1
44 atoms
O  -2.231172 -3.062204 1.121201
O  4.676055 -0.093313 -0.088218
C  -1.832605 -0.715147 0.268967
C  -1.016466 0.572982 0.593928
C  -1.417923 -1.207833 -1.143767
C  -3.361441 -0.427265 0.324744
C  0.489486 0.343678 0.463712
C  -1.426134 1.769139 -0.321076
C  0.092391 -1.531016 -1.247567
C  -1.509702 -1.796198 1.339311
C  1.01792 -0.600025 -0.465976
C  -3.80909 0.91062 -0.246836
C  -2.91906 1.900445 -0.52361
C  1.38077 1.134489 1.219971
C  2.425892 -0.735087 -0.633557
C  -5.30126 1.073747 -0.46153
C  3.294176 0.090679 0.137142
C  2.777858 1.021781 1.068846
C  3.007883 -1.744591 -1.606354
C  5.603672 0.72559 0.689973
H  -1.24541 0.870444 1.639947
H  -1.697466 -0.435062 -1.884769
H  -1.993508 -2.119064 -1.393379
H  -3.710622 -0.481118 1.382547
H  -3.900522 -1.236882 -0.212774
H  -0.920548 1.666459 -1.304481
H  -1.016502 2.702329 0.115007
H  0.3892 -1.54649 -2.314792
H  0.263079 -2.567713 -0.887749
H  -1.734291 -1.386819 2.349785
H  -0.447164 -2.081787 1.315611
H  -3.285183 2.850644 -0.939352
H  0.975467 1.853035 1.943585
H  -5.684562 0.334506 -1.193338
H  -5.554533 2.082953 -0.830567
H  -5.862319 0.904641 0.479969
H  -3.197421 -2.910945 1.275419
H  3.440843 1.648385 1.67233
H  2.648131 -2.767946 -1.38662
H  2.709008 -1.518068 -2.648508
H  4.106339 -1.744416 -1.557822
H  6.606713 0.419287 0.356973
H  5.498451 0.536183 1.776493
H  5.458372 1.805274 0.488481
