program: Gaussian 09
title: 000289516
version: EM64L-G09RevD.01
frameworkgroup: C1[X(C17H18O4)]
method: RPBEPBE
basis: SDD
operation: Freq
keyword: #pfreq=noraman
keyword: PBEPBE/SDD
title: #p freq=noraman PBEPBE/SDD
converged: YES YES NO NO
title: Mulliken charges:
elementType: O O O O C C C C C C C C C C C C C C C C C H H H H H H H H H H H H H H H H H H
charge: -0.253137 -0.186280 -0.257441 -0.230195 -0.279818 -0.465009 -0.581945 0.443754 0.056471 0.112757 0.158588 -0.558055 -0.354152 -0.640315 0.338192 -0.375311 0.149363 0.359140 -0.767678 -0.535651 -0.629810 0.324727 0.238197 0.234401 0.236803 0.230819 0.263481 0.278514 0.320392 0.253145 0.248033 0.244640 0.213290 0.248128 0.249628 0.226889 0.227003 0.226434 0.232008
chargesum: 0.00000
title: Mulliken charges with hydrogens summed into heavy atoms:
elementType: O O O O C C C C C C C C C C C C C C C C C
charge: -0.253137 -0.186280 -0.257441 -0.230195 0.044909 0.007589 -0.114323 0.443754 0.056471 0.112757 0.158588 -0.294574 -0.075638 -0.066778 0.338192 -0.127278 0.149363 0.359140 -0.061620 0.167869 -0.171368
polarizability: 3.09024810e+02 1.69391815e-01 1.70142834e+02 -2.20621379e+01 1.77672464e+01 1.49336153e+02
1716.lowfreq: -9.8341 -5.0682 -0.0008 -0.0006 -0.0004 7.0802 13.4770 16.5425 32.6105
frequency: 12.6311 16.2920 32.5894 51.8347 67.9507 79.3491 102.9428 110.7510 141.8273 148.9526 167.5770 188.5342 215.0315 221.4229 226.1700 266.8420 290.3994 325.7415 329.8406 338.0255 344.8188 376.9582 413.8766 443.8105 450.4726 454.7504 482.6850 528.9834 551.0399 555.7534 576.6061 587.4811 608.9505 640.1323 652.9747 692.6055 710.0505 735.9176 766.3510 800.1873 827.9585 843.5335 880.3914 886.6624 901.4000 914.1614 934.9676 967.2382 972.2877 984.0056 991.9583 999.6271 1017.0016 1044.4592 1051.8152 1066.2975 1096.8906 1111.0884 1122.3038 1135.1714 1145.2065 1162.1528 1176.7542 1178.5251 1208.7033 1235.8736 1255.1915 1261.7284 1268.0680 1278.5626 1296.4942 1329.9079 1333.1695 1356.5749 1385.7052 1395.9329 1401.9185 1426.5133 1434.6120 1446.3648 1450.4685 1453.8182 1468.1821 1468.7936 1471.3820 1472.4651 1485.5511 1541.7649 1564.7390 1571.2538 1616.7625 1624.9882 1643.4450 2897.7288 2919.2257 2960.5162 2969.0962 2992.8460 3014.2401 3042.1031 3061.3784 3075.1801 3076.1490 3082.4445 3104.2301 3105.1397 3132.2161 3150.1509 3152.3728 3171.4709 3206.5550
redmass: 4.6265 4.8577 4.7129 4.6874 4.9275 4.9354 6.4729 4.3113 2.5143 1.2210 3.3789 4.4055 1.4503 3.3073 2.5791 2.8814 4.2235 3.9050 4.5869 3.3750 3.8016 3.5213 3.4591 4.5269 2.8002 3.6299 5.8998 4.1019 3.5309 3.5175 4.8751 1.9731 4.0723 4.5921 3.1012 1.5464 5.6713 3.4681 3.4301 3.2643 1.5575 2.8159 4.4529 1.9948 1.8766 2.6774 2.2119 1.5444 2.1431 1.3822 1.4211 3.2155 3.0874 2.2420 1.5539 2.3891 2.0235 1.2590 1.7399 1.8222 1.4610 1.2598 1.4810 1.5785 1.5894 2.0540 1.7273 3.3186 1.8207 1.5089 1.6175 1.5518 2.6097 1.5240 8.0989 1.2130 1.1347 1.2289 1.2689 3.2097 1.0452 1.1373 1.0500 1.0937 1.0714 1.1078 2.4901 9.9263 8.0263 7.2294 9.0786 7.3152 4.4779 1.0788 1.0670 1.0666 1.0325 1.0361 1.0628 1.0921 1.1044 1.1030 1.0967 1.0900 1.1012 1.0631 1.1002 1.0881 1.0915 1.0958 1.1138
irintensity: 1.9123 0.9262 0.8623 0.8144 2.2287 1.8018 7.1890 6.7489 1.2029 0.3868 2.6516 6.0353 0.0686 21.3549 4.7808 6.4313 6.8329 19.0100 1.9149 0.2815 3.7828 4.4513 0.4603 15.3033 1.0148 5.1329 6.6566 0.4479 1.4371 27.1752 43.9158 20.7968 24.3958 4.7831 6.9877 0.1718 1.5101 1.5905 4.2332 3.9127 29.9885 4.2593 4.8801 24.0847 42.8954 31.7284 14.8042 19.4573 41.2485 2.9761 9.7984 62.3753 2.1061 19.4532 6.8007 78.3129 21.1489 0.3050 128.0825 42.0137 18.8533 38.7014 14.5818 8.2833 195.9676 0.8874 46.2624 614.2922 16.9440 82.6712 21.8358 7.5379 79.8535 51.8988 20.0030 48.6664 74.9686 3.4791 6.7138 3.4034 14.2599 15.0154 14.0676 9.6335 28.8831 56.0208 14.7522 153.2027 96.0144 233.7705 217.7101 165.2492 16.0350 57.1401 142.4453 18.6317 69.5834 15.8693 13.4978 33.4120 41.0606 22.1921 13.4790 3.8809 18.7300 8.7888 22.4936 0.8679 3.8024 15.2869 17.4648
temp: 298.150 k
press: 1.00000 atm
elementType: 8 8 8 8 6 6 6 6 6 6 6 6 6 6 6 6 6 6 6 6 6 1 1 1 1 1 1 1 1 1 1 1 1 1 1 1 1 1 1
symmnumber: 1
zpe: 809769.8 jmol-1
zpe.correction: 0.308425 hartree
zpe.thermalcorrener: 0.328906 hartree
zpe.thermalcorrenthalpy: 0.329850 hartree
zpe.thermalcorrgfe: 0.256524 hartree
zpe.sumelectzpe: -957.947106 hartree
zpe.sumelectthermal: -957.926625 hartree
zpe.sumelectthermalent: -957.925681 hartree
zpe.sumelectthermalfe: -957.999007 hartree
dipole: -2.5248 -2.7263 0.5842
dipole: 3.7614
quadrupole: -84.4010 -123.6304 -128.2758
quadrupole: -0.2517 1.6861 6.6090
quadrupole: 27.7014 -11.5280 -16.1734 -0.2517 1.6861 6.6090
hfenergy: -958.2555311 hartree
pointgroup: C01 [X(C17H18O4)]
dipole: 0.945855 0.1381735 -1.1297236 debye
polarizability: 307.6841404|25.6210468|154.0315736|-8.518996|18.432904|166.7880824 unknown
InChI: InChI=1S/C17H18O4/c1-10(2)15(18)9-16(19)14-6-4-11-8-12(21-3)5-7-13(11)17(14)20/h5,7-8,14H,1,4,6,9H2,2-3H3
charge 0 multiplicity 1
39 atoms
O  -0.500258 -1.077613 -1.089587
O  -2.091115 -1.175634 2.521954
O  5.62596 0.832097 -0.4995
O  -3.220765 1.611865 0.046527
C  -0.737638 0.188419 1.022088
C  0.162296 0.451436 2.249065
C  1.345588 1.360267 1.866976
C  2.153236 0.76622 0.725594
C  0.058983 -0.388761 -0.176442
C  1.510535 -0.073793 -0.240042
C  -1.97313 -0.64782 1.383896
C  3.526847 1.034655 0.592848
C  2.270983 -0.60963 -1.314307
C  -3.060825 -0.823844 0.329239
C  4.272647 0.491436 -0.483107
C  3.64142 -0.339575 -1.44964
C  -3.756561 0.472299 -0.115798
C  -5.100105 0.389893 -0.791478
C  -5.728802 1.721617 -1.150906
C  6.459665 0.298644 -1.58413
C  -5.690524 -0.805523 -1.083011
H  -1.156382 1.154649 0.64943
H  0.527764 -0.509411 2.655376
H  -0.443915 0.919229 3.044436
H  1.998955 1.536671 2.740799
H  0.955816 2.353794 1.559375
H  4.048953 1.666198 1.319028
H  1.750868 -1.242589 -2.040671
H  -2.554688 -1.247184 -0.568586
H  -3.794539 -1.550183 0.714268
H  4.20287 -0.766755 -2.285284
H  -5.879898 2.338469 -0.246765
H  -6.698641 1.580623 -1.656169
H  -5.05861 2.30234 -1.809384
H  7.467278 0.691643 -1.387018
H  6.105611 0.652439 -2.570998
H  6.478725 -0.807587 -1.56659
H  -6.65662 -0.845997 -1.599122
H  -5.233786 -1.768905 -0.834865
