program: Gaussian 09
title: 000289514
version: EM64L-G09RevD.01
frameworkgroup: C1[X(C18H22O3)]
method: RPBEPBE
basis: SDD
operation: Freq
keyword: #pfreq=noraman
keyword: PBEPBE/SDD
title: #p freq=noraman PBEPBE/SDD
converged: YES YES NO NO
title: Mulliken charges:
elementType: O O O C C C C C C C C C C C C C C C C C C H H H H H H H H H H H H H H H H H H H H H H
charge: -0.213837 -0.218007 -0.276039 0.193027 -0.223043 -0.593016 -0.120922 -0.031687 -0.527172 -0.541387 0.265323 0.180909 -0.571451 0.152654 -0.754738 -0.394179 0.159292 -0.422375 0.164449 -0.835106 -0.534073 0.234759 0.235972 0.247881 0.242509 0.218445 0.210349 0.263480 0.229397 0.204483 0.281646 0.218964 0.213133 0.242581 0.218323 0.232421 0.237137 0.231831 0.274334 0.223461 0.217795 0.220269 0.242206
chargesum: 0.00000
title: Mulliken charges with hydrogens summed into heavy atoms:
elementType: O O O C C C C C C C C C C C C C C C C C C
charge: -0.213837 -0.218007 -0.276039 0.193027 0.011716 -0.109163 0.121587 0.186758 -0.053343 -0.107506 0.265323 0.180909 -0.070841 0.152654 -0.080700 -0.161758 0.159292 -0.185238 0.164449 -0.105480 0.146196
polarizability: 2.57386036e+02 2.62714243e+00 1.96386651e+02 1.05138511e+01 1.34756328e+00 1.33011525e+02
1716.lowfreq: -10.5183 -7.6659 -0.0004 0.0002 0.0004 9.4264 33.1653 63.6601 69.1316
frequency: 32.9937 63.6500 69.1273 89.8472 115.4807 126.9418 144.0651 173.7925 193.6843 217.0302 224.9282 238.1666 247.5905 262.8451 271.8937 288.1368 310.5751 331.4863 351.5542 378.7104 400.8852 415.6519 459.7717 465.1803 482.6319 487.3247 513.6157 526.4435 569.2290 578.4449 583.8939 622.1809 646.8776 668.4764 705.3350 734.2009 754.5497 783.4032 804.1811 822.8451 836.7700 858.3078 861.3738 879.3671 915.5215 924.3124 932.6418 970.6052 973.4906 998.9970 1010.9833 1017.0034 1026.7204 1034.9372 1042.6879 1073.4199 1082.9901 1087.3703 1097.7215 1112.0378 1121.5429 1130.8155 1149.2717 1178.0003 1192.0678 1195.3182 1201.0889 1218.1789 1223.1771 1229.8091 1243.7956 1253.1646 1268.9231 1286.2127 1290.8828 1298.1259 1310.1526 1325.9566 1332.9068 1345.3040 1349.2118 1358.0847 1376.5060 1393.4174 1395.1232 1428.5067 1434.0155 1450.8297 1456.2359 1456.9215 1466.0937 1466.3839 1471.0913 1475.8838 1477.4470 1480.8819 1482.6728 1487.3591 1587.7464 1607.5569 1665.4498 2932.6719 2955.4988 2973.5162 2976.5647 2977.1620 2980.1010 2982.6606 2988.6884 3004.5126 3030.5239 3041.7692 3043.3055 3045.9738 3048.5931 3066.5711 3068.9863 3073.5205 3081.9455 3118.3809 3119.0242 3123.1024 3162.1644
redmass: 4.2392 3.6764 3.4417 4.4464 2.8593 1.2859 2.8704 3.2346 3.2241 2.9660 1.9956 1.3822 1.5283 2.8981 1.9305 2.3934 2.7187 3.4323 3.6620 3.0488 3.5036 3.8110 4.0178 5.1569 5.0981 4.2766 3.9992 3.6085 4.4649 3.9592 3.8114 3.7771 4.4293 2.9799 3.6494 5.2577 3.6575 2.6938 1.6654 3.4012 3.8378 2.5150 2.2850 4.3527 1.6223 1.4744 1.9671 2.2446 2.4904 2.9920 2.2364 2.1689 1.8556 2.4742 1.6962 2.6958 2.0383 2.6799 2.7920 1.2605 1.9253 2.0343 1.4313 1.7769 1.6112 1.4146 1.3251 2.5493 1.3761 1.5073 1.6219 2.7308 1.4784 1.4857 1.8064 1.4471 1.7375 1.5732 1.3640 1.4474 1.6104 1.5970 4.6559 1.2028 1.2127 2.5846 1.4111 1.3012 1.0941 1.0859 1.0724 1.1540 1.0873 1.0796 1.0452 1.0530 1.2813 1.3678 7.5236 6.7530 11.8112 1.0828 1.0330 1.0413 1.0595 1.0447 1.0693 1.0615 1.0689 1.0608 1.0966 1.1037 1.1021 1.0964 1.1013 1.1026 1.0939 1.0950 1.0999 1.0959 1.0984 1.0886 1.0939
irintensity: 1.2549 0.6768 1.9787 3.2969 2.0752 0.6579 3.9434 1.2949 1.7801 1.2397 1.8922 0.0893 0.9991 9.5769 1.3647 1.1942 1.1157 0.2812 0.8403 4.6831 1.5426 3.8392 1.4113 0.3492 2.1047 4.6473 5.7551 2.9857 1.6268 2.7355 1.6374 9.4980 1.2299 1.4850 2.6955 4.8401 0.7699 4.1984 35.4976 2.5469 6.7713 4.7210 6.3156 22.1895 20.0859 0.1931 7.9846 20.8241 31.2008 26.6629 9.2340 12.6462 12.8870 92.9416 7.0295 19.7401 5.3023 74.4327 22.8229 0.1175 3.0655 4.8319 1.5224 12.5934 33.6668 5.5918 8.4309 8.7395 12.2102 19.2916 65.5424 48.9557 19.1546 3.1531 15.5635 2.0690 1.8749 7.5287 8.0944 4.2471 2.8273 3.8778 11.5981 13.7940 13.9267 7.3720 11.8657 13.0314 4.1341 12.3987 12.2131 32.4146 15.1621 59.4817 9.4253 7.4263 28.7546 52.4044 2.8563 39.2138 235.2581 19.4814 80.0779 29.5793 14.1145 38.4163 28.1663 19.3011 37.3882 20.0821 29.9636 47.4560 0.8290 32.0607 30.5241 16.1793 9.8744 62.0367 34.8234 16.8660 24.4715 8.9122 17.0424
temp: 298.150 k
press: 1.00000 atm
elementType: 8 8 8 6 6 6 6 6 6 6 6 6 6 6 6 6 6 6 6 6 6 1 1 1 1 1 1 1 1 1 1 1 1 1 1 1 1 1 1 1 1 1 1
symmnumber: 1
zpe: 946558.5 jmol-1
zpe.correction: 0.360525 hartree
zpe.thermalcorrener: 0.379392 hartree
zpe.thermalcorrenthalpy: 0.380337 hartree
zpe.thermalcorrgfe: 0.314642 hartree
zpe.sumelectzpe: -923.233343 hartree
zpe.sumelectthermal: -923.214475 hartree
zpe.sumelectthermalent: -923.213531 hartree
zpe.sumelectthermalfe: -923.279226 hartree
dipole: 0.2452 -3.8254 -4.0369
dipole: 5.5669
quadrupole: -109.3674 -117.1373 -133.9026
quadrupole: -0.8622 11.1528 -6.0023
quadrupole: 10.7684 2.9984 -13.7668 -0.8622 11.1528 -6.0023
hfenergy: -923.5938679 hartree
pointgroup: C01 [X(C18H22O3)]
dipole: 0.1152222 -1.5165905 -1.5759351 debye
polarizability: 257.1368156|2.7572708|196.4086875|11.8469619|0.9213028|133.2387088 unknown
InChI: InChI=1S/C18H22O3/c1-10-9-18-7-6-12-11(2)15(20-3)5-4-13(12)14(18)8-16(10)21-17(18)19/h4-5,10,14,16H,6-9H2,1-3H3
charge 0 multiplicity 1
43 atoms
O  -2.75254 -0.270994 1.54833
O  -1.787273 1.80496 1.733604
O  4.822272 -0.175374 0.246945
C  -1.689861 0.631975 -0.47427
C  -0.858445 -0.681304 -0.693864
C  -3.073852 0.425182 -1.176828
C  -2.940645 -1.386384 0.552959
C  -3.790458 -0.853105 -0.628982
C  -1.538849 -1.839213 0.109863
C  -0.932263 1.843365 -1.044102
C  0.639843 -0.527609 -0.412142
C  -2.025316 0.81424 1.016209
C  0.455732 2.031979 -0.400201
C  1.270237 0.747636 -0.30617
C  -5.251928 -0.581578 -0.217419
C  1.436395 -1.690673 -0.30393
C  2.67225 0.843791 -0.07332
C  2.826671 -1.61993 -0.089145
C  3.439799 -0.350604 0.028036
C  3.353288 2.192967 0.071991
C  5.646357 -1.376079 0.375795
H  -0.970197 -0.903665 -1.777707
H  -2.90383 0.351126 -2.267803
H  -3.705113 1.317824 -1.006484
H  -3.470707 -2.164458 1.126465
H  -3.781761 -1.643807 -1.40634
H  -1.618413 -2.761281 -0.494888
H  -0.950495 -2.080296 1.012992
H  -1.530387 2.762185 -0.898564
H  -0.820249 1.687993 -2.136574
H  0.319814 2.451998 0.615796
H  1.018057 2.791711 -0.974923
H  -5.759952 -1.50924 0.106359
H  -5.291459 0.138212 0.620185
H  -5.826322 -0.15795 -1.061515
H  0.968695 -2.678384 -0.391601
H  3.41003 -2.541991 -0.013362
H  2.849494 2.815846 0.834122
H  4.406471 2.067773 0.362258
H  3.327481 2.762257 -0.878014
H  5.620638 -1.986871 -0.548203
H  5.327566 -1.995995 1.236797
H  6.668623 -1.006135 0.545243
