program: Gaussian 09
title: 000289505
version: EM64L-G09RevD.01
frameworkgroup: C1[X(C18H20O4)]
method: RPBEPBE
basis: SDD
operation: Freq
keyword: #pfreq=noraman
keyword: PBEPBE/SDD
title: #p freq=noraman PBEPBE/SDD
converged: YES YES NO NO
title: Mulliken charges:
elementType: O O O O C C C C C C C C C C C C C C C C C C H H H H H H H H H H H H H H H H H H H H
charge: -0.194387 -0.159154 -0.158178 -0.265412 -0.118520 -0.359562 0.178667 -0.190853 -0.461729 -0.481261 -0.493478 0.272311 -0.584523 0.137746 0.147625 -0.728932 0.287968 -0.404247 -0.531629 -0.406931 0.318511 -0.535399 0.240805 0.302218 0.227549 0.228171 0.228638 0.226219 0.206638 0.220941 0.251756 0.235875 0.236243 0.233716 0.239683 0.236323 0.227199 0.260566 0.242199 0.220884 0.246158 0.219584
chargesum: 0.00000
title: Mulliken charges with hydrogens summed into heavy atoms:
elementType: O O O O C C C C C C C C C C C C C C C C C C
charge: -0.194387 -0.159154 -0.158178 -0.265412 0.122285 -0.057343 0.178667 0.036697 -0.004920 -0.048404 -0.020781 0.272311 -0.112404 0.137746 0.147625 -0.019210 0.287968 -0.177048 -0.271063 -0.164731 0.318511 0.151227
polarizability: 2.44031683e+02 5.91395907e+00 1.98146699e+02 -1.82944497e+01 1.06778383e+01 1.44903601e+02
1716.lowfreq: -8.4903 -0.0006 -0.0002 0.0005 2.7342 10.8305 30.9617 43.5577 74.8787
frequency: 30.9126 43.5249 74.8608 83.3999 94.6688 137.3208 153.4608 157.8847 183.7886 217.1837 219.6850 226.7080 238.6821 257.8017 280.7269 308.4532 324.1149 331.1660 334.6295 366.7318 390.4865 420.0030 439.5301 464.6467 471.6437 523.9297 537.0508 537.9216 554.2194 564.1407 613.7625 625.0471 652.8156 669.3484 700.2300 706.6268 713.4185 738.3567 772.4167 798.9201 813.1582 826.7057 852.3521 862.6869 884.2248 890.3984 900.0102 926.1596 938.7051 965.0291 971.7922 986.6899 999.3894 1005.6521 1013.1275 1053.2939 1069.5118 1094.5674 1112.1668 1112.6906 1117.4730 1125.5795 1129.6601 1147.7042 1169.0689 1177.0376 1186.9393 1193.9051 1198.3756 1226.7896 1236.7166 1253.8045 1261.9418 1268.5519 1281.7801 1296.5646 1305.9895 1317.0892 1338.6585 1347.2040 1354.6699 1362.1907 1369.3866 1375.8513 1389.8139 1423.9451 1438.0376 1459.5177 1466.4575 1467.0038 1471.3952 1472.8553 1473.9459 1478.2939 1482.3236 1497.6310 1575.7688 1625.2131 1694.2593 1761.5324 2937.2118 2958.7212 2966.5095 2969.8845 2983.3265 2989.2596 2993.6679 2998.1693 3025.9231 3044.3600 3046.0784 3054.6436 3056.5770 3066.5021 3083.0030 3092.5921 3124.5386 3130.4636 3139.8883 3164.0169
redmass: 4.9314 6.8288 4.2927 3.8312 4.6112 11.2883 3.7759 7.1555 3.7635 2.0820 2.6191 1.0676 1.5448 2.5694 2.6588 3.3259 2.7074 4.5087 3.2588 4.9458 3.7263 3.9252 2.7742 3.9241 3.5779 4.5056 4.7371 4.3390 5.9173 2.9822 6.0736 4.5430 3.1407 3.8589 4.8426 4.9202 4.8638 4.3288 2.7437 9.9924 1.5949 2.3017 2.0840 4.1268 2.2121 2.3013 2.0472 2.6490 1.4068 2.5479 2.2907 2.6574 1.9772 2.4108 1.9610 2.8664 2.2679 2.0998 1.4894 1.8834 3.1788 1.8340 2.0723 1.4595 1.5073 1.3630 1.4359 1.8141 1.3768 1.7024 1.6979 2.0623 1.6818 1.6804 1.8005 1.3999 1.5998 1.4732 1.5458 1.4453 1.4313 1.3907 1.3193 6.7908 1.1967 3.1882 1.2489 1.0801 1.1364 1.0508 1.0534 1.1091 1.0674 1.0601 1.1078 2.2564 6.9674 6.7827 12.4949 12.4758 1.0814 1.0330 1.0674 1.0795 1.0346 1.0652 1.0676 1.0612 1.0921 1.0967 1.1039 1.1012 1.1026 1.0854 1.1005 1.1006 1.0991 1.0877 1.0914 1.0942
irintensity: 0.4749 1.1701 5.0548 1.5715 2.4621 5.8853 0.1539 1.4479 3.8101 0.4879 0.0303 0.2194 0.6753 0.6241 3.2227 3.6735 0.6646 3.6692 2.8897 6.5017 2.6733 0.4607 6.5285 0.4144 1.2367 12.0160 0.8501 15.2756 11.8185 2.6580 3.0770 10.9640 4.6877 4.3930 5.0448 1.5133 2.5057 31.3795 4.6393 224.6531 44.1202 12.3862 26.6830 1.8288 10.9681 4.1688 23.8212 7.9259 4.5186 57.7400 1.4384 3.7266 18.9192 46.5196 4.9366 14.9570 1.7767 21.9457 26.9116 58.3515 87.1016 18.4147 26.4957 2.7768 18.2490 23.0620 5.4388 13.8009 4.3228 32.9454 37.7979 47.5012 0.8932 55.7955 1.8268 1.4874 2.4727 1.7955 1.8616 1.9586 0.8344 1.5513 24.7986 11.9531 10.4471 20.3387 2.6808 11.4336 9.1495 12.0356 13.1406 25.7809 41.7593 16.7620 31.8236 85.2134 23.7647 81.7988 419.7907 111.4947 18.2132 72.1564 21.6276 12.6448 14.7781 24.8925 60.8008 15.6420 33.3068 33.4171 49.2649 21.7446 24.6558 8.3961 20.0615 17.8168 29.3559 11.4297 3.9834 15.3001
temp: 298.150 k
press: 1.00000 atm
elementType: 8 8 8 8 6 6 6 6 6 6 6 6 6 6 6 6 6 6 6 6 6 6 1 1 1 1 1 1 1 1 1 1 1 1 1 1 1 1 1 1 1 1
symmnumber: 1
zpe: 898902.7 jmol-1
zpe.correction: 0.342374 hartree
zpe.thermalcorrener: 0.361481 hartree
zpe.thermalcorrenthalpy: 0.362425 hartree
zpe.thermalcorrgfe: 0.295673 hartree
zpe.sumelectzpe: -997.206148 hartree
zpe.sumelectthermal: -997.187041 hartree
zpe.sumelectthermalent: -997.186097 hartree
zpe.sumelectthermalfe: -997.252848 hartree
dipole: -6.2036 -2.5592 -0.1983
dipole: 6.7137
quadrupole: -148.6594 -131.4952 -125.3550
quadrupole: 6.6000 -0.9621 -5.3580
quadrupole: -13.4895 3.6747 9.8148 6.6000 -0.9621 -5.3580
hfenergy: -997.5485218 hartree
pointgroup: C01 [X(C18H20O4)]
dipole: -2.4294686 1.0341393 0.070879 debye
polarizability: 243.4617235|-6.94309|197.8679638|19.3921522|11.4102689|145.7522958 unknown
InChI: InChI=1S/C18H20O4/c1-18-8-7-13-12-6-4-11(21-2)9-10(12)3-5-14(13)15(18)16(19)22-17(18)20/h4,6,9,13-15H,3,5,7-8H2,1-2H3
charge 0 multiplicity 1
42 atoms
O  4.036366 -0.401263 -0.295775
O  3.136832 -2.457282 -0.95761
O  4.237721 1.851727 0.304041
O  -5.094755 -0.202433 -0.968585
C  1.099912 -0.865307 1.001775
C  1.632013 -0.511989 -0.438128
C  2.068153 0.973367 -0.632432
C  0.111306 0.205811 1.538052
C  1.201417 2.022301 0.098409
C  0.801321 1.59387 1.523369
C  0.436056 -2.261773 1.037112
C  -1.249462 0.136334 0.825853
C  -0.820414 -2.324358 0.140654
C  2.932422 -1.282573 -0.640263
C  3.521568 0.945918 -0.127495
C  2.141848 1.315402 -2.154663
C  -1.697231 -1.074785 0.211687
C  -2.131217 1.244476 0.829717
C  -2.98202 -1.129513 -0.371217
C  -3.416594 1.195159 0.248952
C  -3.844016 -0.010253 -0.358976
C  -6.029141 0.925205 -0.961709
H  1.968318 -0.872446 1.693605
H  0.887341 -0.814089 -1.191712
H  -0.062417 -0.059267 2.604239
H  0.289539 2.191782 -0.50444
H  1.759067 2.977077 0.127174
H  1.703365 1.539247 2.16551
H  0.155135 2.367721 1.975181
H  0.152979 -2.469932 2.087557
H  1.15151 -3.046788 0.731522
H  -1.422546 -3.211739 0.413382
H  -0.519362 -2.491666 -0.914056
H  1.126184 1.276961 -2.586828
H  2.545116 2.332705 -2.301248
H  2.78348 0.607101 -2.709886
H  -1.819427 2.181438 1.30439
H  -3.339125 -2.052023 -0.842837
H  -4.059852 2.079362 0.280737
H  -6.288299 1.228299 0.071548
H  -6.928572 0.555908 -1.475781
H  -5.61712 1.79461 -1.510528
