program: Gaussian 09
title: 000289490
version: EM64L-G09RevD.01
frameworkgroup: C1[X(C18H20N6)]
method: RPBEPBE
basis: SDD
operation: Freq
keyword: #pfreq=noraman
keyword: PBEPBE/SDD
title: #p freq=noraman PBEPBE/SDD
converged: YES YES NO NO
title: Mulliken charges:
elementType: N N N N N N C C C C C C C C C C C C C C C C C C H H H H H H H H H H H H H H H H H H H H
charge: -0.381719 -0.411447 -0.129859 -0.094135 -0.134549 -0.582698 -0.542824 0.470378 0.141800 0.447894 0.444283 -0.366131 -0.434057 -0.372107 -0.405632 0.455635 0.036806 -0.451082 -0.330844 -0.406232 -0.358888 -0.813604 -0.810648 0.012089 0.241824 0.242454 0.289971 0.250966 0.213460 0.222524 0.221477 0.327781 0.220986 0.307377 0.230100 0.227776 0.218262 0.225693 0.223731 0.230810 0.221833 0.229757 0.334210 0.336579
chargesum: 0.00000
title: Mulliken charges with hydrogens summed into heavy atoms:
elementType: N N N N N N C C C C C C C C C C C C C C C C C C
charge: -0.091748 -0.083666 -0.129859 -0.094135 -0.134549 0.088091 -0.058545 0.470378 0.141800 0.447894 0.444283 -0.115165 -0.220597 -0.149583 -0.184155 0.455635 0.036806 -0.230097 -0.023467 -0.176132 -0.131112 -0.145918 -0.128248 0.012089
polarizability: 3.20158325e+02 5.64137487e+01 2.73191324e+02 5.86342137e+00 -5.44906318e+00 1.78034812e+02
1716.lowfreq: -38.9151 -9.5573 -5.0861 -1.9720 -0.0011 -0.0006 -0.0004 3.9446 8.8070
frequency: -38.9017 -4.8580 8.1506 21.2333 37.2751 44.2301 46.4922 74.9582 104.2803 132.3544 144.2459 169.6170 186.7768 214.8507 221.2878 248.0396 256.4024 310.0099 332.2208 341.7485 343.5777 356.9058 405.1373 410.4836 411.4710 433.2003 455.8246 497.3610 513.2644 514.7050 533.0183 541.9447 546.0635 552.6671 583.8697 632.1043 638.1209 671.1208 681.8527 713.4111 718.9797 725.7886 732.3406 753.6372 761.7474 806.1851 812.2126 818.1435 821.5992 823.1608 835.4595 856.1833 901.7709 929.8371 938.0052 943.9463 954.8273 978.2319 985.3852 992.7947 994.9218 1002.4923 1009.4609 1035.2792 1044.8542 1046.9655 1076.6187 1108.8783 1126.0983 1136.5112 1192.8142 1195.2974 1211.2759 1221.9701 1226.2689 1234.8817 1279.2016 1289.8505 1300.1609 1318.7400 1326.3042 1347.3801 1369.8113 1371.8879 1396.1031 1398.1075 1410.3311 1414.0159 1419.5054 1439.6427 1458.2991 1468.7817 1470.2541 1470.5011 1476.7240 1488.7165 1495.3939 1507.2685 1523.8706 1529.5584 1551.6601 1586.6584 1595.8129 1619.7070 1628.9762 1636.3156 2967.4498 2974.3606 3009.5903 3042.7151 3051.1561 3073.6883 3075.9271 3082.3759 3104.5284 3109.2495 3112.5432 3121.4127 3130.2624 3138.5370 3150.2352 3188.0072 3517.3327 3554.2499 3564.5200 3713.5720
redmass: 1.0297 4.9975 1.0356 4.6660 4.1704 3.6734 4.6745 4.6991 4.2680 4.6569 5.8547 4.2103 7.3230 5.6169 3.9556 3.8972 4.0989 3.1462 2.1665 3.0693 3.3745 2.8842 2.4880 2.9633 2.9026 2.5098 3.5284 1.2397 2.5345 2.4749 4.4748 2.5470 1.7697 2.2980 5.4659 6.7847 6.7844 2.1504 3.5046 2.8564 2.9517 3.8191 3.0251 5.3573 4.7914 5.6526 1.6268 4.8728 1.3521 1.5246 5.8424 1.2889 11.6672 1.3201 2.9010 1.3558 1.3540 1.9460 1.4604 1.9522 1.3437 2.8710 2.9439 3.7446 1.5113 1.5396 2.3526 2.8465 1.3149 1.4617 1.1171 1.1230 2.3482 2.5478 2.7380 1.7597 2.6623 2.2296 2.0683 1.4541 1.7713 1.5558 3.4037 5.2664 1.2329 1.2439 3.9253 3.3135 3.2329 3.2735 1.1527 1.2319 1.0459 1.0549 1.1470 1.3501 4.1351 2.7748 3.1394 2.9764 2.8921 4.8040 3.4822 2.1036 6.2648 6.2960 1.0371 1.0373 1.0609 1.0976 1.0975 1.0983 1.1017 1.0985 1.0865 1.0877 1.0888 1.0908 1.0963 1.0960 1.0947 1.0942 1.0749 1.0443 1.0763 1.1058
irintensity: 0.2988 0.0034 0.4079 0.3358 0.2887 0.9219 0.8560 0.2338 1.7609 0.0540 1.9253 1.9071 0.2898 4.7003 2.0526 4.0726 1.6123 0.9271 17.3697 4.2755 0.6414 7.1660 69.0816 0.2407 7.5496 58.8943 10.5509 256.3233 16.2711 57.3206 23.4302 3.3610 14.9661 11.5353 7.7371 2.4612 3.1924 18.6338 32.4380 1.3563 0.4881 2.8065 9.5513 17.6381 5.9351 9.5787 57.5938 6.9914 24.0277 75.0589 1.0036 18.6151 11.3597 1.9833 1.9039 4.1591 0.2834 1.7372 1.4594 3.8309 4.2719 0.5921 3.4203 1.7535 10.2231 11.2874 4.3289 10.1506 10.5863 24.1116 1.9801 5.2015 7.6483 2.4642 0.9596 21.2106 20.7577 80.0500 9.1727 17.7907 7.4968 17.9045 52.3101 17.4172 3.0233 8.0392 56.2184 152.0308 15.1307 32.8888 12.6175 44.4378 12.3714 12.5858 3.0023 11.4443 977.9849 177.6530 244.9887 391.3666 743.7990 6.6935 254.3211 250.0684 3.5006 86.0318 63.5057 52.2434 33.0643 27.1469 22.1267 21.1555 9.8531 21.4454 17.8958 18.6516 21.5101 20.9204 35.9660 23.2607 7.5133 13.4219 34.4698 132.6279 22.6812 47.5046
temp: 298.150 k
press: 1.00000 atm
elementType: 7 7 7 7 7 7 6 6 6 6 6 6 6 6 6 6 6 6 6 6 6 6 6 6 1 1 1 1 1 1 1 1 1 1 1 1 1 1 1 1 1 1 1 1
symmnumber: 1
zpe: 930433.6 jmol-1
zpe.correction: 0.354383 hartree
zpe.thermalcorrener: 0.375145 hartree
zpe.thermalcorrenthalpy: 0.376089 hartree
zpe.thermalcorrgfe: 0.301789 hartree
zpe.sumelectzpe: -1024.753550 hartree
zpe.sumelectthermal: -1024.732789 hartree
zpe.sumelectthermalent: -1024.731845 hartree
zpe.sumelectthermalfe: -1024.806144 hartree
dipole: -1.2288 2.7307 -1.1396
dipole: 3.2040
quadrupole: -128.0566 -121.4138 -136.7299
quadrupole: 12.8716 2.8534 -5.5278
quadrupole: 0.6769 7.3196 -7.9965 12.8716 2.8534 -5.5278
hfenergy: -1025.1079336 hartree
pointgroup: C01 [X(C18H20N6)]
dipole: 0.9007292 -0.8034539 -0.3634523 debye
polarizability: 276.0639182|55.2729818|313.7792846|14.5021899|24.1622242|181.5412587 unknown
InChI: InChI=1S/C18H20N6/c1-12-3-7-14(8-4-12)20-11-16-22-17(19)24-18(23-16)21-15-9-5-13(2)6-10-15/h3-10,20-21H,11,19H2,1-2H3
charge 0 multiplicity 1
44 atoms
N  -2.89076 -1.70593 1.146542
N  2.657159 -0.369327 -0.326973
N  0.573518 -0.925042 0.728012
N  -0.429036 -3.059392 0.145562
N  1.678098 -2.384758 -0.888867
N  0.660945 -4.428694 -1.415897
C  -1.572412 -1.595061 1.7630
C  -3.405769 -0.751403 0.249572
C  -0.404926 -1.875972 0.815904
C  2.960876 0.897289 0.241784
C  -4.567133 1.193886 -1.531962
C  -2.730288 0.469791 -0.039396
C  -4.663111 -0.986718 -0.376804
C  -3.31356 1.416127 -0.907462
C  -5.222616 -0.032402 -1.249467
C  3.738338 3.451713 1.282447
C  1.599845 -1.232788 -0.138988
C  4.152632 1.530337 -0.202695
C  2.154257 1.548801 1.212716
C  4.530016 2.786583 0.312565
C  2.551032 2.804809 1.713712
C  -5.17961 2.226667 -2.46428
C  4.143658 4.803536 1.844047
C  0.643253 -3.257587 -0.706929
H  -1.518081 -2.324215 2.592393
H  -1.430515 -0.589398 2.193592
H  -3.272166 -2.649064 1.073977
H  -1.744615 0.675458 0.390753
H  -5.203574 -1.919403 -0.168921
H  -2.769426 2.347537 -1.111931
H  -6.192647 -0.243782 -1.717106
H  3.329659 -0.733505 -1.008303
H  4.784821 1.039564 -0.95434
H  1.239121 1.060977 1.551455
H  5.453779 3.256375 -0.045776
H  1.916982 3.295769 2.462841
H  -6.115912 1.853831 -2.916021
H  -5.419422 3.16671 -1.930468
H  -4.491311 2.489835 -3.290004
H  4.337568 4.746822 2.932219
H  5.060256 5.183455 1.360633
H  3.347762 5.557555 1.696302
H  1.427937 -4.614894 -2.056838
H  -0.11093 -5.081089 -1.3047
