program: Gaussian 09
title: 000289513
version: EM64L-G09RevD.01
frameworkgroup: C1[X(C22H24N2O3)]
method: RPBEPBE
basis: SDD
operation: Freq
keyword: #p
keyword: freq=noraman
keyword: PBEPBE/SDD
title: #p freq=noraman PBEPBE/SDD
converged: YES YES NO NO
title: Mulliken charges:
elementType: O O O N N C C C C C C C C C C C C C C C C C C C C C C H H H H H H H H H H H H H H H H H H H H H H H H
charge: -0.292745 -0.262707 -0.236382 -0.111439 -0.407806 -0.197418 -0.080412 -0.225498 -0.446867 -0.359110 -0.552483 0.268196 -0.521980 0.215503 0.179442 0.300923 -0.442826 0.054331 -0.398952 -0.385070 -0.269963 -0.209319 0.179424 -0.394420 0.099451 -0.520852 -0.502721 0.241466 0.246597 0.252799 0.216667 0.195242 0.199215 0.207797 0.197930 0.260274 0.268698 0.238448 0.194985 0.229398 0.227341 0.237911 0.220917 0.219323 0.250410 0.229431 0.208608 0.258039 0.249309 0.237232 0.233666
chargesum: 0.00000
title: Mulliken charges with hydrogens summed into heavy atoms:
elementType: O O O N N C C C C C C C C C C C C C C C C C C C C C C
charge: -0.292745 -0.262707 -0.236382 -0.111439 -0.139108 0.044048 0.166185 0.027300 -0.034957 0.047901 -0.094279 0.268196 -0.088548 0.215503 0.179442 0.300923 -0.213428 0.054331 -0.171611 -0.147159 -0.049045 0.010003 0.179424 -0.144010 0.099451 0.175225 0.217485
polarizability: 3.16174755e+02 1.60703718e+01 2.53631870e+02 3.01561566e+00 -3.43823312e+00 1.99031416e+02
1716.lowfreq: -11.8850 -5.6671 -3.4604 0.0007 0.0008 0.0010 21.2583 22.6012 46.7948
frequency: 20.6334 22.1667 46.7938 53.8389 75.6565 81.4120 93.1723 100.5702 108.3833 116.2494 142.4016 154.7933 165.9555 177.4045 215.3701 229.1092 240.0057 248.8763 254.4923 283.5905 293.6710 304.8892 340.7895 345.6684 384.4951 406.8869 419.9387 427.8768 458.9584 466.3711 469.9977 492.4287 512.2310 528.6983 536.3132 552.6330 568.0234 576.1576 606.2437 635.8557 663.3173 686.2595 704.4555 718.1822 730.2246 745.4051 749.7805 767.3748 787.2162 803.3303 828.0414 843.8144 849.8121 853.3612 882.0595 903.8608 926.4210 927.2944 944.3482 945.4983 964.4276 968.8951 980.7492 996.5759 1013.3988 1017.9311 1027.4053 1044.6888 1053.9539 1080.2143 1091.4380 1097.3423 1110.4770 1110.8349 1118.8794 1140.8322 1145.4421 1146.5120 1151.5551 1166.7921 1170.7882 1175.6519 1200.0423 1212.8287 1220.2647 1229.1285 1235.9043 1239.4012 1243.2144 1258.5306 1264.9957 1281.8967 1291.3131 1302.5157 1312.6095 1328.0447 1335.1078 1344.5616 1353.9604 1360.5474 1369.5401 1372.2720 1393.9105 1414.1947 1421.0269 1424.2238 1425.5205 1434.3329 1450.6104 1453.3081 1454.8827 1456.1546 1458.7170 1464.4936 1471.5973 1478.2508 1478.6044 1481.4147 1589.8048 1596.6423 1602.8892 1620.6948 1624.1325 2801.7686 2829.5885 2852.5975 2944.9710 2963.5979 2978.0844 2994.8855 2998.8083 3003.8839 3023.2744 3027.3054 3031.6818 3050.5078 3066.1894 3105.5123 3116.5668 3120.1579 3120.4883 3123.7492 3140.3491 3149.2986 3160.4168 3160.8532 3548.0558
redmass: 5.0526 4.6399 5.0220 4.2992 4.0235 3.7869 3.1023 3.2998 1.1869 3.2506 3.3209 1.3262 2.4486 3.0405 4.4863 5.5234 2.8346 3.9125 4.6291 3.1497 2.7383 4.7993 4.3587 4.4570 3.3447 4.0206 3.1902 2.5452 4.7328 2.8784 2.3225 3.1107 3.6552 3.9662 4.7546 4.0996 4.4200 4.1505 4.0112 5.4182 3.6889 5.7241 2.8523 5.5632 4.3406 4.5873 1.4982 3.4453 3.6248 2.5027 1.7848 3.7896 1.5036 4.3337 4.1444 3.2831 1.4760 3.4527 1.5465 2.8749 1.2982 2.1177 3.2548 2.2300 3.6887 2.3100 2.9375 2.3102 2.2754 2.6827 2.3866 2.9009 1.2590 1.2970 2.3320 2.0341 2.0907 1.4662 1.3730 1.2092 1.7235 1.7833 1.1858 1.3268 1.7838 1.7548 1.9072 1.3283 1.7928 2.1461 1.7493 1.5555 1.5696 1.6041 1.5474 1.4868 1.5776 1.8000 1.4801 1.4987 2.9984 1.9620 1.7204 1.6765 2.6868 1.2839 1.6049 1.2842 1.0540 1.0540 1.8745 1.1492 1.2835 1.0547 1.9608 1.3662 1.1063 2.2985 7.9182 7.0745 6.5832 9.8654 7.3616 1.0716 1.0802 1.0703 1.0817 1.0324 1.0599 1.0627 1.0852 1.0295 1.0871 1.0898 1.0968 1.1020 1.1020 1.1044 1.0867 1.0918 1.0996 1.0885 1.0938 1.1048 1.0998 1.0955 1.0777
irintensity: 0.0989 0.1904 1.0335 2.1455 2.3289 2.0563 2.8471 3.7645 0.5783 2.4387 2.5534 0.7570 6.0739 3.3907 4.3534 0.7954 6.7974 1.4357 0.7177 3.5328 3.2902 4.0402 9.2656 6.9390 5.5682 1.2504 9.6008 12.4733 10.3877 52.4368 71.6179 22.3738 8.7675 3.2577 5.3555 2.0093 8.7457 9.8807 8.7502 3.4722 6.6472 8.4965 12.4566 4.4109 1.7514 14.1479 77.5839 8.1002 5.8776 7.6255 15.5413 11.5509 1.8256 14.1283 3.0432 9.5485 4.7770 10.0283 2.2356 4.5007 0.0876 14.2507 27.5583 15.3473 84.5096 16.7699 40.2899 14.0648 14.1717 6.6127 8.7493 98.7950 1.2582 1.7456 14.0428 53.2100 4.2456 27.0629 3.1350 5.1174 36.7755 40.0850 7.8571 13.0586 70.3988 28.4649 38.7312 15.9188 33.6037 48.7809 28.8373 4.1525 20.7532 3.2687 6.9778 1.7205 9.0292 43.8813 6.7607 0.4487 17.4715 30.7623 1.8241 6.0659 1.8212 12.7024 8.8893 37.7327 19.6027 13.1760 29.6301 34.7171 18.4656 11.9705 66.9783 31.9522 7.7770 67.3794 34.0496 10.7229 1.3000 221.7230 74.6899 52.4502 44.0154 96.8515 23.1310 74.7745 20.8810 41.3719 21.2022 34.5551 59.5850 26.8204 38.6358 38.8432 25.1770 25.0462 7.1918 24.2590 18.8909 8.1409 30.3979 13.7832 33.2072 10.2264 9.1827
temp: 298.150 k
press: 1.00000 atm
elementType: 8 8 8 7 7 6 6 6 6 6 6 6 6 6 6 6 6 6 6 6 6 6 6 6 6 6 6 1 1 1 1 1 1 1 1 1 1 1 1 1 1 1 1 1 1 1 1 1 1 1 1
symmnumber: 1
zpe: 1091344.3 jmol-1
zpe.correction: 0.415671 hartree
zpe.thermalcorrener: 0.439646 hartree
zpe.thermalcorrenthalpy: 0.440590 hartree
zpe.thermalcorrgfe: 0.361314 hartree
zpe.sumelectzpe: -1185.933322 hartree
zpe.sumelectthermal: -1185.909347 hartree
zpe.sumelectthermalent: -1185.908403 hartree
zpe.sumelectthermalfe: -1185.987679 hartree
dipole: 0.2629 0.7447 0.1989
dipole: 0.8144
quadrupole: -167.0854 -142.8742 -154.8685
quadrupole: 5.5504 -5.3822 6.5278
quadrupole: -12.1427 12.0685 0.0742 5.5504 -5.3822 6.5278
hfenergy: -1186.3489929 hartree
pointgroup: C01 [X(C22H24N2O3)]
dipole: -0.0997123 0.2900018 -0.0928329 debye
polarizability: 315.4898317|-17.3650525|254.6699071|-0.229493|0.5438258|198.6783016 unknown
InChI: InChI=1S/C22H24N2O3/c1-26-19-8-7-13-12-24-10-9-15-14-5-3-4-6-17(14)23-21(15)18(24)11-16(13)20(19)22(25)27-2/h3-8,15,18,21,23H,9-12H2,1-2H3
charge 0 multiplicity 1
51 atoms
O  5.384373 0.072283 -0.775858
O  2.957907 -1.869223 1.517384
O  3.755231 -2.40546 -0.598943
N  -0.734216 1.82479 0.773265
N  -2.284769 -1.63775 0.581468
C  -1.856608 -0.397091 1.291866
C  -0.784737 0.373367 0.446867
C  -3.216289 0.35471 1.46831
C  -3.052678 1.871581 1.672753
C  -2.066309 2.474368 0.666044
C  0.598323 -0.257124 0.724384
C  -4.011911 -0.12885 0.253444
C  0.221946 2.536887 -0.110246
C  -3.428267 -1.350433 -0.193909
C  1.758585 0.499735 0.099253
C  1.571519 1.855538 -0.267111
C  -5.179353 0.359599 -0.347146
C  3.029858 -0.111066 -0.118006
C  -4.010767 -2.097449 -1.240091
C  2.643499 2.587224 -0.833098
C  -5.77168 -0.37366 -1.412851
C  -5.189851 -1.589232 -1.8433
C  4.094438 0.640041 -0.684626
C  3.901141 1.992533 -1.039708
C  3.29074 -1.552943 0.195917
C  5.761636 -0.431948 -2.113607
C  3.218651 -3.273844 1.919277
H  -1.416636 -0.642365 2.275213
H  -1.051998 0.233837 -0.634742
H  -3.707303 -0.072314 2.369275
H  -2.676119 2.065545 2.694763
H  -4.035038 2.373486 1.582957
H  -2.476787 2.37676 -0.372607
H  -1.935118 3.554135 0.868175
H  0.597519 -1.309805 0.380413
H  0.754412 -0.289726 1.820029
H  -1.582303 -2.301313 0.251222
H  0.368891 3.556898 0.294882
H  -0.217845 2.665008 -1.137271
H  -5.636985 1.295416 -0.003592
H  -3.569823 -3.039725 -1.584505
H  2.491855 3.639592 -1.103092
H  -6.679483 -0.000135 -1.898445
H  -5.654317 -2.150627 -2.662558
H  4.74489 2.563782 -1.439525
H  6.819584 -0.723473 -2.029375
H  5.64893 0.359242 -2.881032
H  5.14194 -1.310211 -2.368531
H  4.295895 -3.494733 1.837374
H  2.657932 -3.971279 1.274024
H  2.879803 -3.332979 2.962919
