program: Gaussian 09
title: 000289449
version: EM64L-G09RevD.01
frameworkgroup: C1[X(C8H15NO3)]
method: RPBEPBE
basis: SDD
operation: Freq
keyword: #p
keyword: freq=noraman
keyword: PBEPBE/SDD
title: #p freq=noraman PBEPBE/SDD
converged: YES YES NO NO
title: Mulliken charges:
elementType: O O O N C C C C C C C C H H H H H H H H H H H H H H H
charge: -0.268455 -0.273243 -0.238366 -0.374084 -0.368418 -0.522976 -0.487613 0.248192 -0.336688 0.241975 -0.651667 -0.504706 0.254005 0.234122 0.198023 0.230743 0.231977 0.247491 0.293193 0.258742 0.212412 0.201202 0.239037 0.218238 0.233324 0.239872 0.243668
chargesum: 0.00000
title: Mulliken charges with hydrogens summed into heavy atoms:
elementType: O O O N C C C C C C C C
charge: -0.268455 -0.273243 -0.238366 -0.080891 0.119710 -0.094210 -0.008145 0.248192 0.134466 0.241975 0.006810 0.212158
polarizability: 1.39419567e+02 6.43334855e+00 8.73021261e+01 -5.43456157e+00 1.02837736e+00 8.64824959e+01
1716.lowfreq: -9.0118 -4.8149 0.0006 0.0007 0.0008 5.4719 11.2561 20.2414 40.6287
frequency: 11.0676 19.3763 40.3067 55.0174 78.5778 85.7312 87.3935 121.0319 176.5290 202.4647 218.8242 234.8901 286.0289 311.4875 381.0347 427.5953 442.4805 560.0857 568.0627 599.8219 672.6747 701.4341 749.6840 784.4032 828.0934 844.8155 885.6578 923.8988 957.7867 1038.5995 1047.0347 1068.5867 1081.1421 1106.3937 1112.5933 1119.4363 1142.2901 1147.2074 1162.1010 1221.3008 1247.1207 1278.8527 1283.2769 1290.7917 1336.1479 1356.6410 1360.7784 1388.9704 1421.4305 1442.9314 1449.6609 1452.0535 1462.7018 1464.1160 1471.5018 1480.7781 1483.4572 1491.8619 1619.8083 1647.3603 2971.6224 2975.8081 2981.7340 2994.6752 3004.4309 3013.7103 3027.4392 3054.1447 3065.5952 3084.0303 3084.9294 3097.3830 3106.1266 3148.5000 3548.7046
redmass: 4.7194 3.9529 2.9060 3.2966 3.3834 2.0164 1.1715 2.8426 3.2636 1.6565 4.6568 2.1919 2.7951 3.2153 3.5997 3.3001 2.6127 1.4098 3.2791 2.4748 4.0171 3.1293 1.2827 1.4713 3.8968 1.7675 2.0034 3.3899 5.2761 3.8878 2.0888 3.0292 2.3360 1.9384 1.2872 1.9260 1.9038 1.4469 1.8816 1.7030 1.3041 1.2774 1.1585 1.1905 1.5113 1.3486 1.6229 1.2185 1.1886 1.0923 1.0946 1.0502 1.1319 1.0506 1.0581 1.0833 1.0868 1.6723 6.3383 9.1857 1.0596 1.0651 1.0360 1.0656 1.0295 1.0621 1.0984 1.0946 1.0981 1.0982 1.1029 1.1017 1.1045 1.1048 1.0775
irintensity: 2.1319 2.6609 3.8170 1.3823 0.9054 0.5427 0.1610 1.1859 6.9358 7.1102 3.8814 4.8330 9.4732 32.7085 1.3150 4.5389 3.6336 93.7574 8.0267 15.2762 5.4233 0.7628 14.3272 9.2758 10.6186 1.7066 0.8430 3.7979 24.0439 8.0890 36.9335 5.6786 3.3997 27.4057 4.4586 80.0454 6.7929 8.8688 204.8759 25.9115 47.2460 36.3075 70.0631 34.1930 3.6668 1.8263 24.2554 16.6751 21.3890 8.3196 17.5414 14.4254 61.7680 11.3108 19.9307 13.2513 18.8310 158.5184 164.1436 163.9564 18.9735 18.8125 28.6811 52.9357 32.5948 11.6717 17.5161 1.7913 11.0476 32.5500 35.3330 33.6816 28.0623 17.2165 12.8099
temp: 298.150 k
press: 1.00000 atm
elementType: 8 8 8 7 6 6 6 6 6 6 6 6 1 1 1 1 1 1 1 1 1 1 1 1 1 1 1
symmnumber: 1
zpe: 592701.9 jmol-1
zpe.correction: 0.225748 hartree
zpe.thermalcorrener: 0.240630 hartree
zpe.thermalcorrenthalpy: 0.241574 hartree
zpe.thermalcorrgfe: 0.179648 hartree
zpe.sumelectzpe: -593.323434 hartree
zpe.sumelectthermal: -593.308552 hartree
zpe.sumelectthermalent: -593.307608 hartree
zpe.sumelectthermalfe: -593.369533 hartree
dipole: 0.2025 -0.8192 -3.9869
dipole: 4.0753
quadrupole: -51.5354 -77.8056 -74.1653
quadrupole: 3.8249 -9.3212 1.8862
quadrupole: 16.3000 -9.9702 -6.3298 3.8249 -9.3212 1.8862
hfenergy: -593.5491818 hartree
pointgroup: C01 [X(C8H15N1O3)]
dipole: 0.0793784 -0.8855591 -1.3342203 debye
polarizability: 139.6083506|3.3481759|87.81747|-7.0451402|0.5666972|85.7783681 unknown
InChI: InChI=1S/C8H15NO3/c1-3-9-7(10)5-4-6-8(11)12-2/h9H,3-6H2,1-2H3
charge 0 multiplicity 1
27 atoms
O  -4.135235 -0.512757 0.176101
O  2.13357 -0.197864 1.796852
O  -2.845887 1.355188 -0.345257
N  3.150717 -0.672958 -0.245007
C  -0.426627 -0.225507 0.252654
C  0.751188 -1.2036 0.034595
C  -1.778144 -0.871377 -0.117307
C  2.05876 -0.644161 0.610662
C  4.477819 -0.161298 0.141547
C  -2.923583 0.12813 -0.10983
C  4.834518 1.163567 -0.565306
C  -5.338315 0.355852 0.161851
H  -0.428184 0.087051 1.312153
H  -0.281811 0.690502 -0.348623
H  0.856147 -1.4500 -1.040957
H  0.539418 -2.152352 0.567437
H  -1.728232 -1.298509 -1.140963
H  -2.02945 -1.708496 0.557833
H  3.01622 -1.007997 -1.200509
H  4.44058 -0.014033 1.234424
H  5.242601 -0.932228 -0.074808
H  4.858583 1.045306 -1.664915
H  4.095387 1.944429 -0.316104
H  5.831517 1.513713 -0.240526
H  -6.174247 -0.31908 0.392718
H  -5.463024 0.821064 -0.83057
H  -5.244784 1.149015 0.922456
