program: Gaussian 09
title: 000289506
version: EM64L-G09RevD.01
frameworkgroup: C1[X(C20H24O6)]
method: RPBEPBE
basis: SDD
operation: Freq
keyword: #pfreq=noraman
keyword: PBEPBE/SDD
title: #p freq=noraman PBEPBE/SDD
converged: YES YES NO NO
title: Mulliken charges:
elementType: O O O O O O C C C C C C C C C C C C C C C C C C C C H H H H H H H H H H H H H H H H H H H H H H H H
charge: -0.175698 -0.278123 -0.276342 -0.218516 -0.212755 -0.268419 -0.116942 -0.255838 -0.306401 0.124293 -0.483703 -0.632385 0.346396 0.161794 -0.591280 0.332449 -0.751916 0.176246 0.176185 -0.419414 -0.553918 -0.396002 0.320548 -0.499922 -0.503796 -0.536112 0.231432 0.262832 0.298578 0.240843 0.216211 0.278934 0.253900 0.229072 0.227532 0.250110 0.243476 0.235390 0.236096 0.256603 0.240837 0.244296 0.239646 0.241868 0.240957 0.249664 0.236741 0.219381 0.220879 0.244292
chargesum: 0.00000
title: Mulliken charges with hydrogens summed into heavy atoms:
elementType: O O O O O O C C C C C C C C C C C C C C C C C C C C
charge: -0.175698 -0.278123 -0.276342 -0.218516 -0.212755 -0.268419 0.114489 0.006994 -0.007824 0.124293 -0.026649 -0.099551 0.346396 0.161794 -0.134675 0.332449 -0.022939 0.176246 0.176185 -0.183317 -0.297315 -0.155165 0.320548 0.225887 0.223566 0.148440
polarizability: 2.91673547e+02 2.92752433e+00 2.13380135e+02 -8.61758425e+00 2.41939474e+01 1.87900926e+02
1716.lowfreq: -9.8466 -4.2804 -0.0007 -0.0006 -0.0003 8.8483 30.3154 41.6753 51.1617
frequency: 30.2839 41.6667 51.1133 62.2962 70.8699 73.3092 76.7423 92.8767 97.9212 102.5434 107.9688 126.2196 142.0268 152.3765 179.4822 193.2001 195.7441 203.9032 213.9783 233.3358 238.1309 243.9850 253.2528 267.3825 297.6386 301.1911 308.5533 342.5634 354.4609 363.4841 385.6944 397.6469 441.6255 450.0258 480.3318 502.6318 545.3968 570.3879 572.4680 587.3950 613.1324 622.5515 672.0087 685.0555 708.6245 721.4763 724.8957 729.8309 740.6388 787.9143 805.7697 809.9845 834.9261 852.2760 865.5075 891.3106 896.7080 918.2357 936.9306 946.6828 957.1486 962.6648 982.4088 1000.8380 1019.6697 1038.9663 1045.7637 1071.7942 1089.9305 1110.1123 1112.5551 1112.8037 1113.0422 1122.4381 1135.1452 1143.6425 1145.6312 1147.0376 1154.8262 1157.2495 1172.2298 1177.2619 1195.2444 1210.2783 1212.7008 1228.3197 1242.5215 1261.0334 1268.9561 1279.0350 1302.8507 1310.1527 1324.0635 1328.5726 1338.3408 1353.8294 1367.0145 1385.2364 1387.2030 1420.7208 1421.2997 1426.2529 1438.2430 1451.3502 1452.4129 1452.8115 1457.4283 1460.9158 1462.1353 1464.1873 1465.5794 1474.2945 1477.8397 1478.7202 1495.7148 1580.9208 1615.1310 1625.3923 1634.6220 1641.7570 2957.5302 2959.6500 2960.6564 2990.9907 2997.5760 3005.5458 3006.0389 3006.3890 3012.0440 3026.1144 3044.5209 3044.9523 3051.7672 3080.9534 3106.7360 3108.3483 3109.2859 3112.6020 3115.0373 3123.0205 3139.4475 3152.5093 3153.6398 3162.4424
redmass: 5.0741 6.4716 4.8973 4.0575 4.5381 3.8850 2.8017 2.3008 2.0354 1.1331 3.1423 4.1138 3.6174 3.4846 3.3876 3.9774 4.3491 1.3087 1.9441 1.9118 2.5854 3.0627 2.7486 3.0110 3.5763 4.4032 4.2326 5.1386 4.8322 6.5312 4.4722 3.8205 3.1129 3.4559 4.2958 4.6311 3.9664 3.4449 5.1363 3.3032 4.0378 3.9450 5.7530 3.9993 6.0533 5.6403 5.4433 4.3683 3.8934 4.4364 2.8020 1.6837 2.6482 3.7441 1.9991 1.7135 3.0608 2.9420 1.4835 3.1895 2.9615 2.2522 4.0563 4.7138 2.7576 2.1528 2.3521 2.5929 2.9864 2.4713 1.3475 1.2615 1.2733 2.2064 2.1889 1.5603 1.4748 1.5762 1.8399 2.3446 1.6343 1.4789 2.4806 2.0384 2.2499 1.7080 2.1651 1.8861 1.4706 1.3781 1.2813 1.4428 1.3763 1.4098 1.3920 1.4712 1.5737 4.4228 1.1937 1.1808 1.1792 2.7715 1.3242 1.0735 1.0640 1.0535 1.1122 1.0556 1.0518 1.0508 1.0502 1.0760 1.0855 1.0566 2.5567 7.1370 9.8988 6.9061 9.4683 10.5864 1.0330 1.0656 1.0822 1.0608 1.0651 1.0296 1.0337 1.0301 1.0803 1.0942 1.1038 1.0850 1.1022 1.0985 1.0997 1.1044 1.1047 1.0891 1.1016 1.0993 1.0915 1.1051 1.1050 1.0936
irintensity: 0.3314 0.8828 2.0310 0.7524 1.0017 0.5957 1.7227 5.5673 0.4495 0.0874 1.7602 0.5390 2.3104 3.0310 4.5135 2.5122 1.2867 0.2531 0.8967 3.6917 7.7270 0.1280 0.7249 2.5755 1.9692 8.3467 22.5402 2.5132 6.0665 1.8827 5.3001 2.8553 5.5223 7.9382 0.8590 1.1798 18.6028 6.0442 0.6146 0.4652 5.6923 4.1981 11.7452 10.2621 3.9462 8.9076 1.3424 0.5123 3.1730 7.8385 11.6578 34.0027 1.2657 1.5125 3.5937 21.2007 2.0113 9.6758 0.4972 7.7339 17.8926 2.2766 40.9421 55.1202 12.2543 20.3846 1.6318 174.8019 7.1076 27.2202 7.8175 0.3246 0.2689 55.0003 10.8327 24.9073 13.2786 104.2831 13.0737 190.8869 7.7544 67.8995 8.9964 8.5004 47.7903 5.0676 113.9480 38.5832 7.3813 27.6983 9.8971 17.3067 3.1639 1.2124 0.4049 1.7167 0.1378 8.8831 18.4941 26.7320 8.1107 31.8765 1.0454 7.4610 23.4946 5.1219 16.4972 11.8796 11.2246 9.3859 13.1011 47.6045 12.5275 16.3065 106.1941 22.4044 115.4504 83.8681 172.9594 215.8019 76.5557 30.6920 8.1237 36.8891 0.9385 33.8682 22.6859 18.4896 13.3918 28.3325 49.2674 0.9311 37.5534 10.0839 11.7427 23.6291 24.4632 17.2219 10.8066 24.6479 6.0837 12.0714 9.7228 14.9742
temp: 298.150 k
press: 1.00000 atm
elementType: 8 8 8 8 8 8 6 6 6 6 6 6 6 6 6 6 6 6 6 6 6 6 6 6 6 6 1 1 1 1 1 1 1 1 1 1 1 1 1 1 1 1 1 1 1 1 1 1 1 1
symmnumber: 1
zpe: 1058160.4 jmol-1
zpe.correction: 0.403032 hartree
zpe.thermalcorrener: 0.429104 hartree
zpe.thermalcorrenthalpy: 0.430048 hartree
zpe.thermalcorrgfe: 0.347011 hartree
zpe.sumelectzpe: -1225.917521 hartree
zpe.sumelectthermal: -1225.891449 hartree
zpe.sumelectthermalent: -1225.890504 hartree
zpe.sumelectthermalfe: -1225.973541 hartree
dipole: -1.7512 -0.1061 -1.6056
dipole: 2.3782
quadrupole: -137.7615 -132.9538 -170.2873
quadrupole: -14.2991 -9.4227 9.0655
quadrupole: 9.2394 14.0471 -23.2864 -14.2991 -9.4227 9.0655
hfenergy: -1226.3205526 hartree
pointgroup: C01 [X(C20H24O6)]
dipole: 0.6928665 -0.0506704 0.626765 debye
polarizability: 291.1353694|-6.4822508|212.3531325|-10.3618904|-24.4726395|189.4661059 unknown
InChI: InChI=1S/C20H24O6/c1-20(19(23)26-4)16(21)10-15-13-8-6-12(24-2)9-11(13)5-7-14(15)17(20)18(22)25-3/h6,8-9,14-15,17H,5,7,10H2,1-4H3
charge 0 multiplicity 1
50 atoms
O  -2.191458 1.056865 -2.656812
O  -1.920678 2.684837 0.183438
O  -3.286571 -2.171519 0.488981
O  -2.849035 2.220454 2.264215
O  -2.214989 -2.310976 -1.566058
O  5.965184 -0.740123 0.163696
C  -0.456029 0.104315 1.028977
C  0.368131 0.661471 -0.164238
C  -1.996369 0.359996 0.877473
C  -2.596439 -0.076453 -0.515656
C  -0.108722 -1.38535 1.281604
C  -0.210375 0.17487 -1.536515
C  1.851719 0.301174 -0.051383
C  -1.699153 0.447581 -1.676962
C  1.367362 -1.507992 1.713868
C  2.320693 -0.742586 0.799931
C  -4.061876 0.414658 -0.679624
C  -2.318671 1.81758 1.204625
C  -2.636381 -1.616172 -0.612961
C  2.795516 1.01235 -0.829275
C  3.698267 -1.048568 0.831406
C  4.17458 0.716036 -0.799101
C  4.625386 -0.332979 0.040141
C  -2.204785 4.125536 0.398269
C  -3.453207 -3.645958 0.461205
C  6.96197 -0.032539 -0.642092
H  -0.137852 0.654233 1.940932
H  0.276815 1.763975 -0.160533
H  -2.519553 -0.223696 1.655505
H  -0.273386 -1.988456 0.369066
H  -0.765507 -1.797849 2.070871
H  -0.051274 -0.91584 -1.641835
H  0.315657 0.667233 -2.371612
H  1.666264 -2.572516 1.758255
H  1.471833 -1.114316 2.74679
H  -4.079082 1.51321 -0.765006
H  -4.502324 0.013325 -1.607482
H  -4.673057 0.096146 0.181156
H  2.44455 1.826192 -1.476878
H  4.077992 -1.849218 1.47607
H  4.869024 1.293415 -1.416314
H  -3.283843 4.277325 0.567449
H  -1.874632 4.615939 -0.527676
H  -1.644188 4.496418 1.272519
H  -2.466328 -4.138887 0.474241
H  -3.997861 -3.950038 -0.447811
H  -4.026705 -3.87946 1.368739
H  7.004543 1.042855 -0.379799
H  6.756822 -0.141222 -1.725136
H  7.921621 -0.511072 -0.397167
