program: Gaussian 09
title: 000289451
version: EM64L-G09RevD.01
frameworkgroup: C1[X(C19H30O2)]
method: RPBEPBE
basis: SDD
operation: Freq
keyword: #pfreq=noraman
keyword: PBEPBE/SDD
title: #p freq=noraman PBEPBE/SDD
converged: YES YES NO NO
title: Mulliken charges:
elementType: O O C C C C C C C C C C C C C C C C C C C H H H H H H H H H H H H H H H H H H H H H H H H H H H H H H
charge: -0.274362 -0.223901 -0.385882 -0.384647 -0.384669 -0.382271 -0.382108 -0.372746 -0.374699 -0.353408 -0.409314 -0.356682 -0.316477 -0.696359 0.276873 0.187844 -0.342505 -0.330147 -0.219724 -0.244122 -0.205996 0.195187 0.194949 0.193317 0.193105 0.194105 0.193737 0.192658 0.192490 0.197992 0.197706 0.189431 0.189304 0.192516 0.193412 0.187934 0.187916 0.218398 0.218820 0.194699 0.194675 0.212725 0.212159 0.209788 0.215214 0.209812 0.253884 0.274995 0.229413 0.234781 0.210181
chargesum: 0.00000
title: Mulliken charges with hydrogens summed into heavy atoms:
elementType: O O C C C C C C C C C C C C C C C C C C C
charge: -0.274362 -0.223901 0.004254 0.001776 0.003172 0.002877 0.013590 0.005989 0.011228 0.022442 0.027904 0.032692 0.108407 -0.061545 0.276873 0.187844 -0.088621 -0.055152 0.009688 -0.009341 0.004186
polarizability: 3.00872491e+02 -5.61850538e-01 2.18226170e+02 -8.60874299e-01 1.66812799e-01 1.36506438e+02
1716.lowfreq: -3.5658 -0.0021 0.0010 0.0015 5.4679 10.8253 15.3279 16.0321 33.9490
frequency: 15.1894 15.9259 33.9471 47.2512 51.0866 60.4938 74.7391 93.6861 95.5230 102.5743 117.9722 119.5872 128.7323 135.7865 153.4631 156.4332 156.9898 164.4240 174.6420 210.3117 225.7321 241.4666 268.0923 280.9794 317.7528 376.4411 396.2010 433.8272 450.9919 479.7274 489.9707 520.1453 527.2615 592.3432 640.9345 722.9018 724.4364 729.8651 730.2551 743.2508 764.4252 769.5958 784.4253 801.5645 824.7426 843.5842 865.0524 887.3405 894.1170 945.0270 960.0974 960.6835 981.9415 987.0665 992.8827 993.8547 1005.4866 1019.1758 1032.4605 1037.1903 1039.7784 1055.8537 1072.4402 1078.3854 1081.3340 1082.9385 1096.0925 1099.9107 1125.2554 1149.6149 1172.8243 1182.9498 1199.2701 1204.0241 1205.7484 1220.8480 1230.1780 1235.4291 1256.1196 1262.5198 1277.4439 1280.7433 1282.6836 1285.2099 1288.7555 1293.0636 1294.2981 1301.1272 1302.5116 1314.1085 1335.6010 1350.2302 1354.8238 1356.1715 1358.0535 1359.9069 1387.1146 1389.2834 1399.3538 1440.5332 1461.2004 1461.3593 1464.0745 1464.8278 1465.8079 1467.7911 1470.6666 1474.6780 1476.4952 1479.1082 1483.4385 1487.2811 1490.1861 1492.6709 1574.3286 1591.3593 1615.8577 2949.9683 2950.2008 2951.7210 2952.7814 2952.9316 2955.9135 2957.3672 2960.3993 2962.1930 2966.9113 2969.2084 2972.1659 2983.1901 2986.4279 2991.0126 2995.6868 2996.8258 3004.2733 3013.1033 3015.7103 3026.5060 3036.3482 3043.8038 3065.0091 3068.6820 3070.6985 3133.1749 3144.0233 3164.1616 3175.6554
redmass: 4.5839 4.6431 4.2992 4.5350 1.6602 3.8688 1.5577 3.2864 4.2699 1.7041 5.2612 2.8868 2.7679 1.9493 2.1432 2.7692 2.8196 2.1055 2.8802 4.8216 1.1343 3.7986 3.6769 4.7452 3.6288 4.3951 3.8130 3.6267 2.9816 3.6648 3.1303 4.2255 3.3715 6.6845 6.0979 1.0584 1.0670 1.0837 2.9849 1.1093 1.2661 1.2087 6.0242 1.1709 5.1749 1.2116 1.3695 1.9047 1.2184 1.2033 8.3003 1.3772 4.9341 1.4645 4.6787 1.1660 1.5756 3.8994 1.0679 3.4599 2.1034 3.1900 2.6885 2.4967 2.1111 2.1785 2.4630 2.5018 3.1791 1.4067 1.1084 1.8457 1.8900 1.5524 1.2748 3.4360 1.3994 1.2994 1.3031 1.2971 1.1873 1.0465 1.6373 1.0534 1.3065 1.0800 1.1335 1.0989 1.1183 1.3437 1.4078 1.5184 1.7021 1.7917 1.6985 1.6465 1.4663 1.2173 2.6211 2.4720 1.0746 1.0732 1.1144 1.1269 1.4854 1.0725 1.1266 1.1274 1.0424 1.1235 1.1231 1.1136 1.1016 1.1273 7.5132 6.0315 6.2458 1.0586 1.0585 1.0586 1.0568 1.0591 1.0582 1.0592 1.0865 1.0592 1.0587 1.0586 1.0365 1.0961 1.0971 1.0985 1.0592 1.1004 1.1025 1.1053 1.1052 1.1052 1.1051 1.1047 1.1053 1.1007 1.0992 1.0861 1.0904 1.0953 1.0973
irintensity: 0.2612 0.4056 0.0396 0.6298 0.2693 0.0235 0.0312 0.2513 0.2992 0.0032 0.1525 0.1936 0.3687 0.9437 2.6433 0.4584 0.4780 3.1681 11.8435 2.0699 0.0003 1.6382 2.3321 3.6360 0.7689 1.4493 0.7637 1.2099 6.8773 1.7790 0.4060 3.7441 2.4174 8.6723 18.7323 18.0277 0.3126 8.0903 1.3543 0.7680 70.0205 23.7580 12.6306 0.9582 22.6653 0.3213 0.0135 5.1137 0.5788 0.1938 69.2778 0.7264 1.2688 1.3871 17.6412 0.7998 3.7322 5.9621 0.0217 0.0967 16.0246 1.8114 0.2451 1.7854 0.0769 0.2798 46.0420 4.7356 9.9139 1.0368 34.9471 0.0170 27.5329 0.2300 34.4132 253.4314 0.0302 2.1919 0.0023 2.9700 0.0224 0.0230 64.3220 0.6597 1.4320 0.0177 0.0966 0.1992 0.0039 0.2077 0.0943 2.9048 0.1447 4.1289 2.6318 0.2412 15.7911 11.2585 81.8537 68.4167 0.1803 0.1211 8.3358 9.3275 56.3284 0.0795 9.3613 2.1806 12.3572 6.9193 0.8776 1.8792 21.4289 22.1382 65.7984 169.5303 111.4324 0.0233 0.0040 1.2217 6.1927 2.8383 13.5867 9.5272 61.0302 3.5223 65.0677 249.0905 38.0382 0.0741 0.2022 0.4995 36.5539 0.9495 1.3430 16.9239 2.3519 4.1750 2.6469 239.8976 97.8785 101.5440 55.2501 4.0126 2.9155 26.2065 13.8274
temp: 298.150 k
press: 1.00000 atm
elementType: 8 8 6 6 6 6 6 6 6 6 6 6 6 6 6 6 6 6 6 6 6 1 1 1 1 1 1 1 1 1 1 1 1 1 1 1 1 1 1 1 1 1 1 1 1 1 1 1 1 1 1
symmnumber: 1
zpe: 1171693.0 jmol-1
zpe.correction: 0.446274 hartree
zpe.thermalcorrener: 0.470680 hartree
zpe.thermalcorrenthalpy: 0.471624 hartree
zpe.thermalcorrgfe: 0.388194 hartree
zpe.sumelectzpe: -890.806652 hartree
zpe.sumelectthermal: -890.782246 hartree
zpe.sumelectthermalent: -890.781302 hartree
zpe.sumelectthermalfe: -890.864732 hartree
dipole: -3.7100 -4.7443 0.0196
dipole: 6.0227
quadrupole: -158.9191 -137.1031 -130.9414
quadrupole: -32.5002 -0.0806 0.1132
quadrupole: -16.5979 5.2181 11.3798 -32.5002 -0.0806 0.1132
hfenergy: -891.2529259 hartree
pointgroup: C01 [X(C19H30O2)]
dipole: -1.4345385 1.7673268 -0.6581776 debye
polarizability: 300.8316646|0.417723|209.0447032|2.7613782|-25.7997391|145.7287307 unknown
InChI: InChI=1S/C19H30O2/c1-2-3-4-5-6-7-8-9-10-13-16-21-19-15-12-11-14-18(19)17-20/h11-12,14-15,17H,2-10,13,16H2,1H3
charge 0 multiplicity 1
51 atoms
O  3.791728 -0.305628 0.183854
O  6.839713 -2.839614 1.158704
C  -3.782743 -0.301586 0.097628
C  -5.077868 0.484332 -0.207133
C  -2.496251 0.502832 -0.194943
C  -6.365225 -0.317895 0.087851
C  -1.201748 -0.28319 0.111037
C  -7.660321 0.46902 -0.215248
C  0.0830 0.525933 -0.17662
C  -8.948366 -0.332101 0.080027
C  1.371617 -0.27094 0.132642
C  -10.243261 0.456814 -0.220957
C  2.631034 0.550844 -0.145251
C  -11.525177 -0.351732 0.074253
C  5.076804 0.219811 0.029496
C  6.161613 -0.651436 0.366635
C  5.339665 1.535548 -0.430466
C  7.492956 -0.176425 0.235035
C  6.674494 1.978513 -0.55045
C  7.758167 1.128595 -0.219132
C  5.915858 -2.033154 0.847686
H  -3.773665 -1.237712 -0.49906
H  -3.785814 -0.612928 1.163304
H  -5.076116 0.794401 -1.273313
H  -5.086282 1.421353 0.388431
H  -2.493707 0.81392 -1.260776
H  -2.506786 1.438881 0.402054
H  -6.358117 -1.25454 -0.508208
H  -6.366958 -0.628821 1.153737
H  -1.188858 -1.216936 -0.48858
H  -1.205915 -0.596937 1.175592
H  -7.659051 0.779888 -1.281257
H  -7.667372 1.405781 0.380845
H  0.067454 1.458597 0.425452
H  0.084577 0.840172 -1.241422
H  -8.944314 -1.268094 -0.51724
H  -8.950792 -0.64453 1.145548
H  1.375784 -0.586102 1.193621
H  1.401747 -1.19335 -0.478233
H  -10.247594 1.390763 0.377653
H  -10.239228 0.770419 -1.285056
H  2.686727 0.849353 -1.212537
H  2.658543 1.46395 0.484796
H  -11.567715 -0.652256 1.13835
H  -12.435751 0.234829 -0.147775
H  -11.56059 -1.274531 -0.535296
H  4.522606 2.212298 -0.693756
H  8.299335 -0.869006 0.501767
H  6.867743 2.997031 -0.906054
H  8.788269 1.485328 -0.316649
H  4.847549 -2.333358 0.922913
