program: Gaussian 09
title: 000289453
version: EM64L-G09RevD.01
frameworkgroup: C1[X(C16H24O5)]
method: RPBEPBE
basis: SDD
operation: Freq
keyword: #pfreq=noraman
keyword: PBEPBE/SDD
title: #p freq=noraman PBEPBE/SDD
converged: YES YES NO NO
title: Mulliken charges:
elementType: O O O O O C C C C C C C C C C C C C C C C H H H H H H H H H H H H H H H H H H H H H H H H
charge: -0.289561 -0.289349 -0.268245 -0.292525 -0.262467 -0.371836 -0.249066 -0.342180 -0.254265 -0.263829 -0.687786 -0.271061 -0.306604 0.362754 -0.335431 -0.365401 0.235275 -0.356424 -0.309403 0.173901 -0.501490 0.186506 0.206583 0.194490 0.180816 0.183879 0.227457 0.198802 0.198618 0.202980 0.207050 0.204021 0.210867 0.216408 0.205502 0.207771 0.225526 0.226413 0.254995 0.253193 0.268307 0.272672 0.241150 0.241212 0.229776
chargesum: 0.00000
title: Mulliken charges with hydrogens summed into heavy atoms:
elementType: O O O O O C C C C C C C C C C C C C C C C
charge: -0.289561 -0.289349 -0.268245 -0.292525 -0.262467 0.021252 0.126239 0.069157 0.143156 0.146201 -0.056491 0.142212 0.145335 0.362754 -0.080436 -0.112208 0.235275 -0.088117 -0.036731 0.173901 0.210648
polarizability: 3.18735279e+02 5.51920097e+00 1.75988526e+02 4.23099610e+00 4.61831205e+00 1.19955726e+02
1716.lowfreq: -12.7394 -7.6059 -0.0012 0.0007 0.0013 2.5709 5.7981 18.0003 19.6597
frequency: -10.7054 17.7595 19.5502 33.7528 48.5735 59.9958 65.0602 73.1518 84.9078 89.5074 99.7591 111.6528 119.4656 128.7953 141.0335 146.5882 156.1322 171.9895 198.7530 228.0752 254.5796 287.5743 288.6583 306.9317 319.5784 358.4242 411.7507 417.0134 443.0475 471.6229 506.3953 525.4031 540.6271 625.7091 628.9427 677.1393 735.6097 746.6690 753.6162 804.6888 819.4288 822.4009 829.5344 836.0076 845.2690 854.8661 910.5642 924.0368 948.2430 962.8567 977.1598 986.3457 987.2199 1002.4253 1014.9784 1048.8131 1064.2324 1068.5079 1088.5050 1095.9813 1098.9081 1114.3829 1115.5523 1116.5482 1118.6035 1130.5338 1145.2506 1146.8785 1166.9664 1175.3871 1178.9680 1213.4177 1235.1392 1242.3086 1253.5503 1259.3219 1264.3063 1289.0672 1301.4836 1303.5813 1304.0391 1330.3157 1360.6034 1363.0342 1379.8267 1389.7967 1399.0334 1423.2647 1424.4366 1428.7051 1450.9663 1451.1746 1464.8912 1475.1801 1476.1782 1477.7484 1478.4722 1483.8720 1486.7309 1492.9212 1496.8007 1499.6517 1574.4708 1617.6558 1623.9122 2912.1751 2939.2387 2945.3962 2953.6495 2959.9881 2970.2470 2973.4093 2982.1094 2982.6542 2984.1551 3000.1727 3001.7532 3018.5398 3026.4963 3046.2330 3055.4397 3071.9356 3072.1640 3101.8228 3145.0558 3149.9164 3159.8532 3170.0879 3183.1492
redmass: 4.1608 3.8452 4.8781 3.7195 4.3055 3.0449 1.8537 2.6965 2.1341 2.7383 1.9207 3.7867 2.1258 3.7851 3.2298 3.2612 5.1909 4.6922 3.1266 1.1788 2.1685 4.1401 4.4652 6.6692 3.8808 4.7586 4.9331 2.9869 4.0136 5.5913 2.9426 4.0818 2.7590 6.9076 7.1316 4.2154 1.2064 5.4258 4.5891 5.3043 1.7229 1.2371 1.3398 1.6080 1.1926 1.5493 2.2809 8.0874 3.8584 1.2775 1.3567 1.3493 7.0681 2.9585 3.6470 4.0230 4.7997 4.3766 3.4786 3.5209 1.4254 1.2638 1.6145 1.4791 1.8713 1.9812 1.8393 1.4718 1.1377 1.2188 1.1636 1.2605 3.4178 1.2838 1.1474 3.9914 1.1470 1.1242 1.2919 1.2721 1.1903 1.2619 1.6166 1.3853 4.0352 1.2154 1.5225 1.3469 1.3804 4.0601 1.0500 1.0820 1.0522 1.0828 1.0575 1.0485 1.1050 1.1533 1.0825 1.0977 1.1310 1.9475 7.7932 7.3021 8.3312 1.0552 1.0555 1.0552 1.0547 1.0967 1.0395 1.0616 1.0699 1.0551 1.1044 1.1064 1.0296 1.1101 1.0945 1.1009 1.1098 1.1007 1.0994 1.1043 1.1046 1.0881 1.0887 1.0960 1.0969
irintensity: 0.1181 0.6034 0.0810 0.0752 0.3646 1.2532 0.5244 0.8586 0.8931 0.1417 0.0862 0.1705 3.6339 3.1816 2.6877 14.2189 1.8316 15.6892 2.4331 0.6142 4.0412 0.7394 20.5220 0.0864 0.6889 0.3858 8.0512 0.0145 3.3603 6.6522 8.5696 3.1486 0.1301 13.3565 14.7967 27.2731 5.5285 8.6840 16.8238 17.5302 8.5553 6.4495 3.3316 0.6649 12.9086 46.8991 13.5393 4.6849 3.4485 9.2119 1.1481 0.0813 94.6391 28.5183 8.0056 6.6497 342.1901 129.8528 226.7714 32.8264 0.1335 0.1194 4.3317 14.4702 2.3794 2.4881 10.0567 94.5304 1.6156 159.5723 11.1093 1.8236 188.1340 2.6214 0.0360 434.6151 0.9473 0.3845 2.3800 0.6138 13.8446 5.8990 0.6328 1.9309 40.6512 10.4962 0.4182 39.0819 13.3251 2.5494 13.5956 6.7905 13.1073 3.3047 10.3673 8.4777 3.9879 62.7755 14.7417 6.6805 16.5229 33.4283 0.9667 395.7101 97.8788 54.5552 50.0041 27.1013 94.0142 35.8925 43.3571 7.7011 95.9590 33.5078 1.9028 32.9948 47.8807 91.2988 18.0477 8.2921 51.5290 81.6335 68.9249 28.7904 17.8995 2.8818 2.8192 11.9237 3.2158
temp: 298.150 k
press: 1.00000 atm
elementType: 8 8 8 8 8 6 6 6 6 6 6 6 6 6 6 6 6 6 6 6 6 1 1 1 1 1 1 1 1 1 1 1 1 1 1 1 1 1 1 1 1 1 1 1 1
symmnumber: 1
zpe: 982225.9 jmol-1
zpe.correction: 0.374110 hartree
zpe.thermalcorrener: 0.397292 hartree
zpe.thermalcorrenthalpy: 0.398236 hartree
zpe.thermalcorrgfe: 0.317652 hartree
zpe.sumelectzpe: -998.541026 hartree
zpe.sumelectthermal: -998.517843 hartree
zpe.sumelectthermalent: -998.516899 hartree
zpe.sumelectthermalfe: -998.597484 hartree
dipole: -2.2887 -0.6699 -0.0589
dipole: 2.3854
quadrupole: -115.7559 -125.7018 -127.4474
quadrupole: -20.1471 -2.2255 -0.2792
quadrupole: 7.2125 -2.7334 -4.4790 -20.1471 -2.2255 -0.2792
hfenergy: -998.9151356 hartree
pointgroup: C01 [X(C16H24O5)]
dipole: 0.8383294 0.3227507 -0.2717192 debye
polarizability: 302.519644|53.7083885|138.4475562|-4.6318125|-14.4736807|173.7123298 unknown
InChI: InChI=1S/C16H24O5/c1-3-4-9-19-10-11-20-12-13-21-15-7-5-14(6-8-15)16(17)18-2/h5-8H,3-4,9-13H2,1-2H3
charge 0 multiplicity 1
45 atoms
O  5.328782 1.352948 0.184677
O  1.790376 0.389538 0.277872
O  -1.603564 -0.313315 -0.890935
O  -7.714896 -2.063855 -0.357718
O  -7.12972 -2.374334 1.877588
C  7.668407 1.965113 0.416815
C  6.407637 1.529427 1.17006
C  7.526958 3.341003 -0.272846
C  4.065397 0.951373 0.804689
C  3.056013 0.814861 -0.333764
C  8.795451 3.744573 -1.054054
C  0.711875 0.265664 -0.703257
C  -0.504984 -0.214263 0.085409
C  -2.851811 -0.743816 -0.432472
C  -3.131608 -1.095296 0.914405
C  -3.869586 -0.81567 -1.41969
C  -5.454474 -1.592005 0.28186
C  -4.429965 -1.516494 1.258676
C  -5.159569 -1.236205 -1.063885
C  -6.802558 -2.042749 0.709103
C  -9.083822 -2.502169 -0.007227
H  8.512937 1.991483 1.135866
H  7.912616 1.192847 -0.338916
H  6.577925 0.570136 1.708589
H  6.108295 2.298878 1.918308
H  7.299981 4.110466 0.49376
H  6.65598 3.306846 -0.95326
H  4.173369 -0.017956 1.33794
H  3.718883 1.714709 1.534423
H  2.932451 1.78751 -0.85526
H  3.407691 0.061554 -1.069704
H  9.676169 3.803868 -0.38622
H  9.023742 3.005297 -1.844977
H  8.673285 4.730228 -1.539533
H  0.973829 -0.468342 -1.494667
H  0.498897 1.243163 -1.18561
H  -0.303194 -1.20177 0.543514
H  -0.758566 0.512609 0.881138
H  -2.358067 -1.044215 1.685674
H  -3.622212 -0.537808 -2.448479
H  -4.671167 -1.793704 2.290272
H  -5.950663 -1.29482 -1.815991
H  -9.520999 -1.827921 0.748658
H  -9.067136 -3.529016 0.395791
H  -9.644585 -2.455872 -0.951521
