program: Gaussian 09
title: 000289446
version: EM64L-G09RevD.01
frameworkgroup: C1[X(C15H12ClNO2)]
method: RPBEPBE
basis: SDD
operation: Freq
keyword: #p
keyword: freq=noraman
keyword: PBEPBE/SDD
title: #p freq=noraman PBEPBE/SDD
converged: YES YES NO NO
title: Mulliken charges:
elementType: Cl O O N C C C C C C C C C C C C C C C H H H H H H H H H H H H
charge: -0.075633 -0.262335 -0.255258 -0.081767 0.218158 0.174478 0.502828 -0.495214 -0.334548 -0.381121 -0.202974 0.119067 0.364201 -0.396092 -0.236550 -0.373112 -0.796991 -0.266068 -0.208924 0.300173 0.255714 0.236258 0.241987 0.242322 0.232182 0.254584 0.239388 0.243583 0.250531 0.256615 0.234519
chargesum: 0.00000
title: Mulliken charges with hydrogens summed into heavy atoms:
elementType: Cl O O N C C C C C C C C C C C C C C C
charge: -0.075633 -0.262335 -0.255258 -0.081767 0.218158 0.174478 0.502828 -0.195042 -0.078834 -0.144863 0.281334 0.119067 0.364201 -0.163910 -0.236550 -0.118528 -0.063489 -0.009453 0.025595
polarizability: 3.68506243e+02 1.36796829e+01 1.72930174e+02 5.56144273e+00 -5.46156074e+00 1.04595932e+02
1716.lowfreq: -29.1372 -2.3951 -0.0002 0.0009 0.0015 2.3287 4.9317 24.2182 40.2174
frequency: -29.0517 24.1426 40.2099 41.6704 97.9404 106.5909 145.3032 153.7527 204.8410 210.1705 223.6960 254.5627 271.0123 312.6738 346.9859 366.7119 385.7236 420.3164 435.4138 478.5393 501.3253 517.2066 559.8795 567.1521 605.4681 614.5085 649.9515 680.6310 707.7203 725.8868 762.7821 777.2139 781.9274 793.2444 813.8888 839.9152 851.8610 891.5735 910.5471 932.9797 933.8172 966.7795 978.2854 987.2684 1004.6925 1038.2211 1059.2074 1064.1377 1067.5432 1120.3379 1120.8216 1136.4659 1170.2379 1187.3839 1209.8877 1219.4027 1257.0792 1264.4211 1347.2496 1355.4263 1367.6969 1403.4355 1404.8095 1427.6371 1442.7167 1458.4821 1471.7676 1474.9691 1479.1854 1485.5836 1552.2670 1588.2536 1602.0991 1621.6701 1624.2534 2965.1872 2987.2216 3018.2457 3067.9093 3098.0110 3105.4281 3138.1344 3143.6587 3165.9520 3179.3157 3184.6680 3187.0495
redmass: 2.2744 6.6284 6.1429 6.0708 5.2879 7.0132 1.4855 2.7272 4.0812 5.1555 4.8148 5.3676 4.4975 4.9920 4.3080 6.1989 5.1142 4.6339 3.1190 5.8284 3.6571 4.6372 5.6903 5.8902 6.0077 4.5168 7.6800 9.5275 2.5580 4.2839 5.0677 5.0681 1.8528 3.8118 1.3718 10.8519 5.1641 1.4107 1.3730 3.5660 1.3675 1.3246 4.5375 1.5669 1.6799 1.4712 3.6287 1.4589 2.0990 1.0807 2.0465 1.5358 1.6058 1.6825 2.3155 2.0691 1.3300 3.4749 5.6425 1.9951 1.3764 1.2931 2.5239 2.4271 2.8870 3.9179 1.1209 1.2092 2.3621 1.2724 5.6160 7.8729 7.8975 7.1125 8.3155 1.0864 1.0406 1.0534 1.0940 1.1191 1.0991 1.0901 1.0868 1.0930 1.0989 1.0946 1.0944
irintensity: 15.2124 0.6442 0.0203 0.1255 0.7426 2.6769 1.7230 1.8709 9.8904 1.7893 1.8891 3.1623 2.0697 3.4661 8.7999 3.2294 0.8765 5.0971 8.9846 16.0715 0.1988 8.2133 13.7019 0.7054 12.1961 8.8715 5.0138 0.5487 16.3708 5.1823 4.3058 26.6614 42.8638 19.7133 45.1945 22.4511 69.0891 1.4868 15.9335 27.0467 4.8129 1.5582 158.8647 51.7296 57.9600 2.1880 35.7928 4.4753 3.7147 0.2328 3.9480 20.8391 12.4299 15.6236 1.4149 92.0891 10.1711 307.0611 12.2827 35.1447 18.3497 12.4753 21.8217 63.3683 67.9569 153.7558 17.5825 2.3867 72.3980 31.3206 68.9857 262.1888 0.7641 105.8275 2.7969 36.6617 17.9365 139.3111 13.8404 28.7335 9.7008 7.1277 9.0690 5.5041 10.6917 1.7090 8.3217
temp: 298.150 k
press: 1.00000 atm
elementType: 17 8 8 7 6 6 6 6 6 6 6 6 6 6 6 6 6 6 6 1 1 1 1 1 1 1 1 1 1 1 1
symmnumber: 1
zpe: 604952.7 jmol-1
zpe.correction: 0.230414 hartree
zpe.thermalcorrener: 0.246255 hartree
zpe.thermalcorrenthalpy: 0.247199 hartree
zpe.thermalcorrgfe: 0.185328 hartree
zpe.sumelectzpe: -1242.685326 hartree
zpe.sumelectthermal: -1242.669485 hartree
zpe.sumelectthermalent: -1242.668541 hartree
zpe.sumelectthermalfe: -1242.730412 hartree
dipole: -3.3688 -0.3012 0.9739
dipole: 3.5197
quadrupole: -107.7574 -111.5304 -117.5090
quadrupole: 4.1243 5.9036 -0.1315
quadrupole: 4.5082 0.7352 -5.2434 4.1243 5.9036 -0.1315
hfenergy: -1242.9157399 hartree
pointgroup: C01 [X(C15H12Cl1N1O2)]
dipole: 1.3265068 0.2197775 -0.331039 debye
polarizability: 369.4751382|-4.3947739|137.8139188|0.2095925|34.2404616|138.7432921 unknown
InChI: InChI=1S/C15H12ClNO2/c1-10-12(16)3-2-4-13(10)17-8-11-5-6-14-15(7-11)19-9-18-14/h2-8H,9H2,1H3
charge 0 multiplicity 1
31 atoms
Cl -5.644372 -1.73028 -0.639473
O  4.265358 0.369818 1.729775
O  5.479713 -0.210762 -0.260375
N  -0.88886 0.441835 0.385231
C  3.37267 0.167292 0.647832
C  4.094621 -0.174746 -0.522913
C  1.308473 0.018402 -0.574895
C  1.988168 0.272822 0.660446
C  3.454682 -0.427073 -1.739339
C  2.039842 -0.324208 -1.745594
C  5.625106 0.125105 1.18618
C  -2.306992 0.495493 0.336044
C  -3.124922 -0.598907 -0.116224
C  -0.157514 0.10653 -0.648281
C  -4.52472 -0.385851 -0.074646
C  -2.906438 1.685843 0.834193
C  -2.546237 -1.933726 -0.54949
C  -5.135331 0.800508 0.370728
C  -4.303423 1.845589 0.834103
H  1.413172 0.535173 1.551399
H  4.020113 -0.689152 -2.636506
H  1.495657 -0.512939 -2.678174
H  6.074865 -0.737233 1.707243
H  6.224337 1.046658 1.278232
H  -0.604071 -0.103629 -1.642242
H  -2.245973 2.474207 1.207073
H  -2.526994 -2.034589 -1.651247
H  -1.518037 -2.067626 -0.177094
H  -3.166656 -2.762199 -0.168117
H  -6.224276 0.896527 0.370783
H  -4.752559 2.77402 1.201447
