program: Gaussian 09
title: 000289450
version: EM64L-G09RevD.01
frameworkgroup: C1[X(C18H27BrO2)]
method: RPBEPBE
basis: SDD
operation: Freq
keyword: #p
keyword: freq=noraman
keyword: PBEPBE/SDD
title: #p freq=noraman PBEPBE/SDD
converged: YES YES NO NO
title: Mulliken charges:
elementType: Br O O C C C C C C C C C C C C C C C C C C H H H H H H H H H H H H H H H H H H H H H H H H H H H
charge: -0.051661 -0.253795 -0.256265 -0.383065 -0.383944 -0.385326 -0.377196 -0.370714 -0.377502 -0.385416 -0.312881 -0.513540 -0.695004 0.267186 -0.487006 0.470993 -0.367561 -0.383637 -0.229147 -0.226000 -0.232758 0.194737 0.194926 0.195224 0.195223 0.197178 0.196111 0.197788 0.197577 0.194808 0.192321 0.198499 0.198224 0.206469 0.231273 0.226786 0.226508 0.236517 0.247047 0.277945 0.278207 0.240616 0.223158 0.267284 0.233595 0.228614 0.227600 0.230006
chargesum: 0.00000
title: Mulliken charges with hydrogens summed into heavy atoms:
elementType: Br O O C C C C C C C C C C C C C C C C C C
charge: -0.051661 -0.253795 -0.256265 0.006598 0.006503 0.007962 0.018169 0.016415 0.019222 0.052325 0.140413 -0.029976 -0.138852 0.267186 -0.023232 0.470993 -0.100277 -0.150042 -0.000534 0.001600 -0.002752
polarizability: 2.94136797e+02 -1.26686959e+01 1.76948795e+02 7.74344856e+00 3.27541524e+00 1.78563460e+02
1716.lowfreq: -11.1283 -1.4577 -0.0013 -0.0004 0.0007 2.2738 6.5133 13.3143 16.0808
frequency: -7.8116 13.0779 15.3979 24.1318 32.0097 42.1566 48.9249 53.9245 72.5078 74.9178 88.2124 108.9371 114.6778 123.0222 132.3961 143.6967 154.3647 168.0729 203.6913 223.3435 252.9124 290.7534 327.8134 364.6530 371.9784 403.9998 422.9620 468.5974 476.6739 499.4156 579.8075 595.1337 616.2750 617.6624 666.8299 704.9524 721.2175 724.8940 734.8229 750.4862 754.5655 777.6786 814.8058 819.2513 828.7492 859.4049 884.5427 900.0051 937.5763 946.9327 978.6024 983.1967 983.8661 988.5164 990.5107 1001.6674 1005.0885 1026.5094 1027.3329 1033.0531 1052.6280 1065.2330 1068.2914 1079.5244 1080.8908 1090.3921 1091.4723 1097.3328 1145.1924 1173.6705 1188.7225 1190.6874 1198.1239 1217.5397 1222.1605 1223.1993 1231.5326 1244.9534 1250.8117 1269.2710 1276.0270 1280.2153 1286.9916 1288.4224 1295.4817 1297.2312 1306.8552 1327.2341 1329.3095 1340.2108 1347.5900 1354.3405 1357.5211 1361.8790 1385.5812 1442.3664 1443.1160 1449.2602 1459.7093 1460.4677 1461.9267 1464.0977 1465.4857 1470.8469 1478.0783 1484.4104 1484.9663 1487.9958 1594.6440 1615.0514 1634.4903 2950.6844 2951.9816 2953.9885 2957.3952 2962.0164 2967.6906 2976.5887 2985.4394 2988.2249 2991.8365 2996.9777 2999.4139 3011.3515 3027.0862 3037.6618 3039.9817 3046.6870 3047.3006 3059.7628 3071.6222 3112.5916 3120.7146 3128.3105 3131.6312 3140.2160 3151.0181 3165.2016
redmass: 3.2045 5.0398 3.5827 3.6823 4.3380 5.3908 3.0446 2.7176 4.9464 2.6580 2.2307 3.1305 3.5314 2.9947 2.7310 2.1692 2.0660 4.9257 4.4459 5.1871 5.2735 4.4099 3.3731 3.4272 2.7975 2.8215 3.4015 3.4721 3.1427 3.9263 3.3358 4.5163 4.8478 6.2598 4.3580 1.8405 1.0609 1.0827 1.1056 1.1541 2.0584 1.2349 4.4680 3.2887 1.3673 1.2523 1.3210 4.7277 1.5249 1.2764 1.9550 4.9882 1.4581 4.6365 5.4587 1.3313 1.1919 2.8420 3.0227 3.8654 1.0605 3.5453 2.5746 2.1449 2.1032 1.8186 1.6368 4.0756 2.2015 1.0542 1.1213 1.6335 1.2356 1.3902 2.7717 1.3221 1.1648 1.3093 1.3097 1.2400 1.1849 1.0915 1.1089 1.1144 1.0972 1.1332 1.3077 1.3601 1.2645 1.3674 1.4394 1.5904 1.6404 1.6545 8.1412 2.1695 1.0864 1.1026 1.0738 1.0742 1.1312 1.0651 1.0760 1.0912 1.0978 1.1008 2.3083 1.1005 6.0855 6.0915 9.3305 1.0588 1.0587 1.0592 1.0589 1.0592 1.0585 1.0655 1.0950 1.0668 1.0944 1.0594 1.1001 1.1032 1.1044 1.0585 1.1037 1.0563 1.1001 1.1042 1.0985 1.1074 1.0865 1.0874 1.1112 1.0921 1.0965 1.1016
irintensity: 0.0540 0.0621 1.0860 0.1934 0.1357 1.6806 0.7584 0.4774 0.5309 0.3868 0.3039 0.1214 0.3651 1.0073 0.8002 0.1894 0.0240 2.7232 3.5712 2.0182 9.0639 5.6418 0.1400 4.6396 7.3464 0.0380 0.8994 13.0231 0.0222 5.2427 0.4861 20.9786 39.5341 0.9784 3.1833 50.9787 16.3950 0.4889 10.6510 5.7602 70.6083 3.3596 9.8223 2.9268 0.1701 0.4621 1.5638 86.8832 1.3465 1.2588 6.8227 6.0118 0.2943 21.0099 1.6688 0.5225 2.0359 6.6023 1.6467 1.1051 2.2707 37.9121 0.4841 17.9929 7.3094 92.7184 31.3687 0.3940 179.1720 0.0814 0.4318 0.1355 36.1722 7.6823 21.8458 48.7326 10.3823 3.0553 4.9759 7.9755 26.1247 15.2725 0.6240 6.2219 0.2769 0.6640 4.7460 30.9033 0.9724 6.3988 7.6204 4.3004 3.6609 16.6346 0.7242 9.9260 14.6478 2.5704 0.0246 0.4615 17.0682 0.1564 1.2072 0.0912 3.2652 0.5187 8.5436 36.3876 2.0769 0.4161 131.2961 2.1590 2.1356 0.3299 3.0834 13.6352 156.9037 1.8462 2.1446 42.5751 7.0891 26.5986 0.6641 4.3177 1.3228 33.6219 72.3933 24.9103 75.4751 70.8292 48.3146 5.3497 5.4506 1.4753 18.9176 18.2860 28.1209 21.2687
temp: 298.150 k
press: 1.00000 atm
elementType: 35 8 8 6 6 6 6 6 6 6 6 6 6 6 6 6 6 6 6 6 6 1 1 1 1 1 1 1 1 1 1 1 1 1 1 1 1 1 1 1 1 1 1 1 1 1 1 1
symmnumber: 1
zpe: 1075789.5 jmol-1
zpe.correction: 0.409747 hartree
zpe.thermalcorrener: 0.433027 hartree
zpe.thermalcorrenthalpy: 0.433971 hartree
zpe.thermalcorrgfe: 0.350158 hartree
zpe.sumelectzpe: -864.402069 hartree
zpe.sumelectthermal: -864.378789 hartree
zpe.sumelectthermalent: -864.377844 hartree
zpe.sumelectthermalfe: -864.461658 hartree
dipole: -3.0637 -0.5710 -0.6800
dipole: 3.1898
quadrupole: -168.6615 -132.6186 -138.2615
quadrupole: -12.7010 14.8913 3.5068
quadrupole: -22.1477 13.8953 8.2524 -12.7010 14.8913 3.5068
hfenergy: -864.8118158 hartree
pointgroup: C01 [X(C18H27Br1O2)]
dipole: -1.1962642 -0.0420592 -0.3769998 debye
polarizability: 295.0184981|-10.6729021|173.5438088|0.4992127|-0.5069489|181.0867457 unknown
InChI: InChI=1S/C18H27BrO2/c19-15-11-6-4-2-1-3-5-10-14-18(20)21-16-17-12-8-7-9-13-17/h7-9,12-13H,1-6,10-11,14-16H2
charge 0 multiplicity 1
48 atoms
Br 11.715946 1.073087 0.542739
O  -3.699936 -0.470012 -1.356298
O  -2.834868 -1.554403 0.523441
C  3.686069 0.296563 -0.245311
C  4.998336 -0.460872 0.059138
C  2.432515 -0.605249 -0.185139
C  6.246044 0.450246 0.025696
C  1.124301 0.150712 -0.509293
C  7.560072 -0.30912 0.32289
C  -0.131663 -0.739101 -0.385147
C  8.797666 0.626127 0.293379
C  -1.42379 0.01782 -0.764871
C  10.083011 -0.148939 0.584474
C  -2.685676 -0.763089 -0.437707
C  -5.044918 -1.112446 -1.101451
C  -5.928957 -0.217996 -0.26186
C  -5.888543 -0.29186 1.155184
C  -6.809167 0.705353 -0.880911
C  -6.7115 0.549067 1.936505
C  -7.633398 1.546226 -0.10036
C  -7.58576 1.469349 1.311195
H  3.75629 0.761605 -1.250982
H  3.569529 1.132147 0.476134
H  5.124575 -1.284993 -0.673666
H  4.920655 -0.940717 1.05715
H  2.353347 -1.055843 0.82612
H  2.553192 -1.450894 -0.893801
H  6.12156 1.269602 0.763546
H  6.320915 0.93502 -0.969741
H  1.187987 0.56827 -1.536014
H  1.025395 1.019745 0.174822
H  7.483895 -0.797254 1.316511
H  7.688678 -1.123198 -0.420083
H  -0.022879 -1.630494 -1.034486
H  -0.228576 -1.116586 0.65022
H  8.671617 1.433157 1.039708
H  8.87305 1.112216 -0.697765
H  -1.476142 0.966418 -0.190703
H  -1.438177 0.297106 -1.832738
H  10.298133 -0.918968 -0.172958
H  10.097501 -0.590376 1.593383
H  -4.863907 -2.086083 -0.614636
H  -5.44501 -1.251369 -2.117913
H  -5.203249 -1.000956 1.633324
H  -6.845388 0.766649 -1.975649
H  -6.674341 0.48537 3.029745
H  -8.311337 2.255221 -0.588589
H  -8.225998 2.119343 1.918373
