program: Gaussian 09
title: 000289439
version: EM64L-G09RevD.01
frameworkgroup: C1[X(C14H9BrN2O4)]
method: RPBEPBE
basis: SDD
operation: Freq
keyword: #p
keyword: freq=noraman
keyword: PBEPBE/SDD
title: #p freq=noraman PBEPBE/SDD
converged: YES YES NO NO
title: Mulliken charges:
elementType: Br O O O O N N C C C C C C C C C C C C C C H H H H H H H H H
charge: 0.043951 -0.257056 -0.249123 -0.214085 -0.211421 -0.062185 0.019735 0.219131 0.178966 0.499368 -0.471166 -0.332410 -0.371891 -0.203364 -0.384189 0.419807 -0.389167 -0.302854 0.394804 -0.336189 -0.373662 0.300262 0.260272 0.238017 0.246690 0.246814 0.238240 0.258978 0.304988 0.288738
chargesum: 0.00000
title: Mulliken charges with hydrogens summed into heavy atoms:
elementType: Br O O O O N N C C C C C C C C C C C C C C
charge: 0.043951 -0.257056 -0.249123 -0.214085 -0.211421 -0.062185 0.019735 0.219131 0.178966 0.499368 -0.170904 -0.072138 -0.133874 0.290141 -0.145949 0.419807 -0.389167 -0.043876 0.394804 -0.031201 -0.084924
polarizability: 4.78410019e+02 -1.56375619e+01 1.94181835e+02 -9.10139964e+00 -1.23516712e+01 1.03280363e+02
1716.lowfreq: -2.8048 -0.0006 -0.0004 0.0005 2.9985 5.5934 21.1513 30.9467 33.0363
frequency: 21.1345 30.9309 33.0341 47.7151 57.6550 85.7073 101.2488 122.1694 155.2951 174.4389 204.0848 222.0097 229.0118 275.9112 290.3517 340.3224 366.3632 381.1383 426.9287 435.7116 453.0675 489.9359 530.5348 534.6722 548.5091 598.2766 610.6779 637.5626 678.0201 681.4104 687.8530 725.6426 737.2590 758.8692 772.9345 798.1238 814.3896 834.1504 839.4733 851.5389 908.9621 926.9169 933.6368 935.5122 976.5990 978.3816 980.6425 1019.3249 1063.1473 1065.4759 1099.7500 1120.7587 1128.4633 1133.8929 1180.1494 1205.5273 1216.3592 1250.0411 1259.4930 1270.3409 1341.4145 1356.7454 1367.9003 1376.6352 1404.6883 1418.3328 1453.0010 1464.6813 1484.6604 1486.8575 1558.7759 1579.9117 1597.8030 1621.0310 1627.5746 2964.1820 3024.0117 3105.8019 3140.7761 3149.2856 3185.7397 3186.4327 3187.5742 3188.8341
redmass: 7.1537 10.7123 7.4622 2.3843 14.3315 8.0497 7.8758 13.2508 5.3748 9.3211 7.1268 4.1371 7.0238 14.0714 8.2041 5.8738 4.9095 8.8763 3.8683 3.7065 3.9659 7.8997 6.7050 4.6554 5.4482 6.3553 4.4564 7.9543 9.9257 9.5913 6.0167 4.5647 4.5248 7.0551 7.1273 4.9694 1.3541 2.2848 4.2323 5.5876 1.3697 1.4176 2.8780 1.5234 1.4187 3.7834 1.6221 3.1031 3.6687 1.4538 3.2986 1.0372 1.4175 1.3854 2.1445 6.0422 2.5996 1.5195 1.3172 3.1537 4.3674 2.0557 1.5017 6.8374 3.5632 3.8320 3.0416 2.9741 3.5450 1.3019 8.3021 7.7543 7.9950 7.2090 8.4602 1.0875 1.0535 1.1192 1.0903 1.0899 1.0941 1.0940 1.0938 1.0954
irintensity: 0.2589 0.1309 0.4159 15.9060 0.1969 0.6994 2.1906 1.3726 0.0465 3.8258 1.6762 4.5889 4.6878 2.2549 2.4678 5.2793 4.0885 4.4020 10.4597 9.1045 4.5521 7.0166 17.8654 1.1164 8.5498 12.9937 13.1902 12.6240 43.0462 1.6342 21.1430 4.3699 5.3806 18.1647 12.9371 9.2406 43.3725 62.0401 3.0602 66.1100 15.1185 26.4474 52.2463 5.4027 13.1296 149.7871 53.6597 28.4270 70.5573 4.3439 38.3335 0.0179 15.5831 48.2674 112.6698 879.7512 262.9777 46.9096 6.4692 250.2913 10.5669 38.5025 26.7348 101.3934 36.3068 61.8215 133.1758 204.2721 30.4419 50.8237 6.8302 723.8848 13.8199 211.7475 87.5506 32.9494 133.5764 24.5185 5.5456 4.1513 1.1640 0.7519 7.7509 8.8885
temp: 298.150 k
press: 1.00000 atm
elementType: 35 8 8 8 8 7 7 6 6 6 6 6 6 6 6 6 6 6 6 6 6 1 1 1 1 1 1 1 1 1
symmnumber: 1
zpe: 535389.2 jmol-1
zpe.correction: 0.203919 hartree
zpe.thermalcorrener: 0.221875 hartree
zpe.thermalcorrenthalpy: 0.222819 hartree
zpe.thermalcorrgfe: 0.154047 hartree
zpe.sumelectzpe: -961.159337 hartree
zpe.sumelectthermal: -961.141382 hartree
zpe.sumelectthermalent: -961.140438 hartree
zpe.sumelectthermalfe: -961.209210 hartree
dipole: -9.0848 -1.7799 0.9662
dipole: 9.3078
quadrupole: -149.0764 -123.6144 -127.6029
quadrupole: 3.5621 5.4999 -4.0480
quadrupole: -15.6452 9.8168 5.8283 3.5621 5.4999 -4.0480
hfenergy: -961.3632562 hartree
pointgroup: C01 [X(C14H9Br1N2O4)]
dipole: 3.5293522 -0.7736457 -0.5960254 debye
polarizability: 479.1199271|3.1746938|183.1426812|-10.8018318|31.2379874|113.6096083 unknown
InChI: InChI=1S/C14H9BrN2O4/c15-11-6-10(17(18)19)2-3-12(11)16-7-9-1-4-13-14(5-9)21-8-20-13/h1-7H,8H2
charge 0 multiplicity 1
30 atoms
Br -1.590969 3.007806 0.237874
O  4.877193 0.920466 1.474462
O  6.192953 -0.292997 -0.126457
O  -6.420538 -1.407094 0.256805
O  -6.572108 0.86519 0.433899
N  -0.212153 0.201562 0.078889
N  -5.891259 -0.227416 0.309457
C  4.040019 0.286559 0.526497
C  4.823898 -0.428965 -0.415506
C  2.040019 -0.413012 -0.606234
C  2.654055 0.318388 0.463417
C  4.247564 -1.14773 -1.467535
C  2.833254 -1.126889 -1.548586
C  6.268305 0.579367 1.084271
C  0.583151 -0.437657 -0.745339
C  -1.604139 0.085887 0.056836
C  -2.429053 1.247314 0.197053
C  -2.256229 -1.187365 0.006176
C  -4.422135 -0.125515 0.220129
C  -3.823992 1.155588 0.274388
C  -3.651399 -1.30186 0.087518
H  2.033904 0.86878 1.174744
H  4.861444 -1.693025 -2.18772
H  2.337776 -1.673806 -2.358906
H  6.746973 0.012293 1.899944
H  6.809931 1.503297 0.820969
H  0.183495 -1.009086 -1.609215
H  -1.635631 -2.086925 -0.063294
H  -4.45736 2.040217 0.373813
H  -4.153967 -2.27167 0.054548
