program: Gaussian 09
title: 000289428
version: EM64L-G09RevD.01
frameworkgroup: C1[X(C15H17NO2)]
method: RPBEPBE
basis: SDD
operation: Freq
keyword: #p
keyword: freq=noraman
keyword: PBEPBE/SDD
title: #p freq=noraman PBEPBE/SDD
converged: YES YES NO NO
title: Mulliken charges:
elementType: O O N C C C C C C C C C C C C C C C H H H H H H H H H H H H H H H H H
charge: -0.278740 -0.282547 -0.703838 -0.319785 -0.314220 0.351682 0.441148 0.343815 -0.333627 -0.375789 -0.423920 -0.331379 -0.313145 -0.359665 0.498998 -0.809137 -0.424443 -0.392697 0.221511 0.221403 0.217780 0.217713 0.248418 0.246194 0.226947 0.229075 0.244282 0.242550 0.227938 0.222829 0.228515 0.213622 0.216019 0.301424 0.301068
chargesum: 0.00000
title: Mulliken charges with hydrogens summed into heavy atoms:
elementType: O O N C C C C C C C C C C C C C C C
charge: -0.278740 -0.282547 -0.101345 0.123129 0.121274 0.351682 0.441148 0.343815 -0.085209 -0.129594 -0.196973 -0.102304 -0.068863 -0.117116 0.498998 -0.129855 -0.210821 -0.176678
polarizability: 2.92248291e+02 2.74318974e+00 1.69474907e+02 -4.07701063e-02 -2.18190505e-03 8.35010303e+01
1716.lowfreq: -8.5741 -7.6143 -0.0011 -0.0010 0.0009 1.1731 18.4408 32.2433 33.5439
frequency: 18.4403 32.2288 33.4807 40.2159 50.4654 110.6554 115.6142 142.9467 157.3587 160.2461 187.0230 265.2776 292.2969 328.6798 332.0653 332.4084 351.4339 365.6416 412.0436 414.0268 414.5454 466.7299 506.7696 510.8975 516.7855 556.5609 633.8255 635.8297 710.1952 711.1077 719.6505 761.6527 793.0629 808.4347 816.7469 817.7502 827.6399 832.1806 854.9370 910.6850 931.6223 938.7637 962.1489 980.2850 991.7766 998.0545 1003.9543 1006.6325 1017.1792 1046.9692 1107.9033 1108.2455 1120.2024 1127.0947 1174.2539 1178.5997 1181.3952 1212.3441 1219.9110 1229.0373 1267.2556 1304.9119 1305.8524 1312.8896 1325.2452 1370.2240 1381.3815 1397.1673 1402.6644 1414.3236 1438.2770 1470.1109 1476.5073 1479.6968 1489.1760 1503.4998 1511.9665 1586.9418 1588.1626 1626.1750 1633.7597 1648.1230 2964.7326 2972.4104 2974.4706 3019.8994 3048.9022 3049.7600 3079.6505 3120.7176 3120.9723 3123.2522 3124.0038 3156.1603 3158.2745 3161.8360 3162.4443 3574.1459 3714.6677
redmass: 5.1434 4.2481 1.7729 1.5960 4.6876 3.3307 5.4987 2.3601 4.0862 3.4122 5.7911 3.8481 1.1895 4.2828 1.3491 1.8563 7.0520 3.2830 4.7558 2.8631 2.8266 4.2521 2.4619 2.2490 6.9399 4.6201 6.7989 6.6968 2.9978 3.3134 5.5170 5.4461 1.3003 1.3950 1.6955 5.9385 1.3639 6.1802 1.1241 1.3839 1.3212 1.3448 1.3482 1.6041 3.3427 4.4168 3.6509 3.0776 1.4754 1.5279 1.4535 2.8015 1.2577 1.1951 1.1220 1.2146 1.2291 2.6531 2.4276 5.7652 1.1443 1.5994 1.4609 1.8411 1.3301 3.9702 4.0450 1.2516 1.8024 3.4828 3.4982 1.0457 1.0992 1.1154 1.2119 2.1679 2.6789 6.6181 7.0919 6.3370 1.5454 2.6916 1.0559 1.0374 1.0542 1.1061 1.0978 1.1103 1.0984 1.0891 1.0894 1.0885 1.0890 1.0943 1.0942 1.0954 1.0955 1.0448 1.1041
irintensity: 0.6356 0.4822 0.0960 0.7062 0.4924 10.1985 0.1103 0.1468 1.5254 0.0057 0.0607 4.3920 317.8657 5.3154 10.1914 5.2791 0.8997 5.1395 0.5742 0.0217 0.0238 0.0414 20.2026 25.3413 0.8403 10.5100 0.1227 0.1388 0.5722 0.4803 48.9887 13.4190 18.3167 46.7085 76.8528 2.2425 36.0871 0.0815 2.0194 0.0792 1.0982 0.1460 0.4909 16.9139 10.4923 20.9114 51.9934 96.0306 1.0576 11.2113 0.0007 0.0086 16.5732 20.3145 2.1695 51.4874 49.5481 562.5944 6.5568 75.0811 0.0052 1.1762 4.7725 8.6250 11.5260 2.9614 20.9676 11.2710 2.2218 3.1389 3.8458 12.3496 12.5293 2.0837 197.7483 183.1087 234.1524 15.6118 1.3578 41.5387 49.1814 121.1677 14.7078 55.6038 43.8917 2.8809 17.1978 76.1172 20.1319 14.5471 18.4015 47.0879 19.9894 18.5335 17.7256 4.1619 3.3874 68.6021 19.1292
temp: 298.150 k
press: 1.00000 atm
elementType: 8 8 7 6 6 6 6 6 6 6 6 6 6 6 6 6 6 6 1 1 1 1 1 1 1 1 1 1 1 1 1 1 1 1 1
symmnumber: 1
zpe: 747340.2 jmol-1
zpe.correction: 0.284647 hartree
zpe.thermalcorrener: 0.302433 hartree
zpe.thermalcorrenthalpy: 0.303377 hartree
zpe.thermalcorrgfe: 0.236290 hartree
zpe.sumelectzpe: -785.662467 hartree
zpe.sumelectthermal: -785.644681 hartree
zpe.sumelectthermalent: -785.643737 hartree
zpe.sumelectthermalfe: -785.710824 hartree
dipole: 1.8946 0.3187 0.0548
dipole: 1.9220
quadrupole: -66.3559 -96.6541 -114.3137
quadrupole: 4.9772 0.3210 0.0209
quadrupole: 26.0853 -4.2129 -21.8724 4.9772 0.3210 0.0209
hfenergy: -785.9471141 hartree
pointgroup: C01 [X(C15H17N1O2)]
dipole: -0.7449796 0.1291116 -0.0118289 debye
polarizability: 292.1692938|-3.4073417|169.4978819|-3.1134872|-0.8562747|83.5570526 unknown
InChI: InChI=1S/C15H17NO2/c1-12-2-6-14(7-3-12)17-10-11-18-15-8-4-13(16)5-9-15/h2-9H,10-11,16H2,1H3
charge 0 multiplicity 1
35 atoms
O  1.644948 0.720607 -0.148981
O  -1.698503 -0.737473 -0.08578
N  -7.238455 0.44803 -0.022215
C  0.649823 -0.358522 -0.125907
C  -0.708239 0.340766 -0.113679
C  3.002577 0.349142 -0.168871
C  5.806754 -0.179311 -0.209629
C  -3.061495 -0.35657 -0.071449
C  3.469249 -0.986077 -0.160933
C  3.928039 1.421909 -0.196953
C  4.863433 -1.23264 -0.181484
C  5.30839 1.153521 -0.216646
C  -3.525143 0.97956 -0.078377
C  -3.995509 -1.419478 -0.048933
C  -5.862022 0.187552 -0.039954
C  7.301785 -0.449772 -0.233188
C  -4.912993 1.245055 -0.062997
C  -5.37568 -1.153816 -0.033227
H  0.745987 -1.000628 -1.023553
H  0.769289 -0.983543 0.781072
H  -0.82872 0.965605 -1.021367
H  -0.799758 0.986631 0.782727
H  2.77468 -1.8312 -0.138408
H  3.544474 2.447101 -0.202257
H  5.216806 -2.271034 -0.174995
H  6.015382 1.992291 -0.237961
H  -2.827279 1.822395 -0.096022
H  -3.621136 -2.448212 -0.043962
H  7.811225 0.015999 0.631741
H  7.516614 -1.53213 -0.204568
H  7.772977 -0.039172 -1.146591
H  -5.259158 2.285964 -0.068742
H  -6.086176 -1.989432 -0.015202
H  -7.588238 1.400673 -0.035483
H  -7.910826 -0.31219 -0.018426
