program: Gaussian 09
title: 000289393
version: EM64L-G09RevD.01
frameworkgroup: C1[X(C11H7BrO3)]
method: RPBEPBE
basis: SDD
operation: Freq
keyword: #p
keyword: freq=noraman
keyword: PBEPBE/SDD
title: #p freq=noraman PBEPBE/SDD
converged: NO YES NO NO
title: Mulliken charges:
elementType: Br O O O C C C C C C C C C C C H H H H H H H
charge: 0.014285 -0.354938 -0.457733 -0.214235 0.270002 0.598251 -0.056082 0.138052 -0.491243 -0.344817 -0.259098 -0.405321 -0.275521 -0.241302 0.105208 0.303508 0.186051 0.261238 0.238741 0.239927 0.359197 0.385828
chargesum: 0.00000
title: Mulliken charges with hydrogens summed into heavy atoms:
elementType: Br O O O C C C C C C C C C C C
charge: 0.014285 0.004260 -0.071905 -0.214235 0.270002 0.598251 -0.056082 0.138052 -0.491243 -0.158767 0.044410 -0.144083 -0.036780 -0.001375 0.105208
polarizability: 2.07418868e+02 -1.59436505e+01 1.99866092e+02 -1.46233104e-04 -3.78024228e-03 5.29765539e+01
1716.lowfreq: -6.9046 -5.5868 -0.0006 -0.0004 0.0002 2.6844 38.1591 57.9410 97.1071
frequency: 38.1148 57.9343 97.0999 112.0112 137.3950 180.5919 216.1768 262.5619 296.5055 316.9041 337.3682 347.6137 386.3133 424.9656 475.7330 476.1146 553.9574 575.2783 584.0871 589.5209 624.4693 649.2653 704.4018 714.5510 744.7386 760.8716 796.4269 846.7585 875.2150 900.3675 932.3761 955.1546 999.0887 1007.6071 1041.3863 1091.3094 1135.7634 1166.3224 1187.8945 1212.8336 1264.9474 1273.7125 1299.3193 1337.5929 1379.3281 1416.7513 1435.2054 1446.6277 1507.4477 1579.2120 1597.9787 1625.0555 1649.7383 3089.1215 3142.5038 3159.0143 3173.1681 3196.9874 3534.0227 3568.8993
redmass: 11.9927 5.9136 3.0308 6.6037 11.9414 8.2090 4.6423 14.9862 1.3487 7.5165 6.2239 7.7693 8.8084 2.5107 7.2061 3.2743 5.9809 4.9223 1.3457 3.3069 6.5849 3.6451 6.8108 6.1404 5.2314 1.4626 2.8340 6.4251 1.8375 5.7185 1.4606 1.3836 1.3496 4.0043 2.2019 3.1629 1.5065 1.5323 1.1327 2.3922 1.6319 2.0275 2.3094 4.0966 2.6945 6.0933 3.2043 2.9728 3.7182 8.0692 6.4577 6.5204 8.7786 1.0882 1.0874 1.0931 1.0999 1.0925 1.0642 1.0651
irintensity: 1.7318 0.1387 3.8721 2.0244 0.1639 1.4051 0.8779 0.1284 79.7136 4.3615 10.4377 0.2280 0.7759 42.7517 2.7593 2.7527 25.7647 21.1389 137.8544 0.0838 42.1603 19.3654 45.0033 13.6595 33.8434 92.0132 0.3965 20.4187 6.9119 58.1095 13.0255 1.8602 0.5208 284.0307 43.8977 95.1043 188.4989 24.0851 5.4195 8.9358 40.3051 25.1987 64.6413 154.8071 19.5436 0.5825 8.3153 19.1068 15.8767 5.2659 59.8775 100.0344 273.2138 17.3780 5.7899 9.3248 19.5158 6.8411 51.6113 29.8407
temp: 298.150 k
press: 1.00000 atm
elementType: 35 8 8 8 6 6 6 6 6 6 6 6 6 6 6 1 1 1 1 1 1 1
symmnumber: 1
zpe: 397696.6 jmol-1
zpe.correction: 0.151475 hartree
zpe.thermalcorrener: 0.164384 hartree
zpe.thermalcorrenthalpy: 0.165328 hartree
zpe.thermalcorrgfe: 0.110545 hartree
zpe.sumelectzpe: -661.469298 hartree
zpe.sumelectthermal: -661.456388 hartree
zpe.sumelectthermalent: -661.455444 hartree
zpe.sumelectthermalfe: -661.510227 hartree
dipole: -2.1399 2.9613 -0.0006
dipole: 3.6536
quadrupole: -100.3150 -74.5460 -99.0865
quadrupole: -8.7150 -0.0006 -0.0037
quadrupole: -8.9991 16.7698 -7.7707 -8.7150 -0.0006 -0.0037
hfenergy: -661.6207724 hartree
pointgroup: C01 [X(C11H7Br1O3)]
dipole: 1.3341022 -0.5347416 0.0208259 debye
dipolederiv: -0.083971 -0.1679058 0.0015393 -0.1359185 -0.6484467 0.0071967 0.0015134 0.007049 -0.0284583 -0.147475 -0.3176871 0.0061217 -0.2766892 -1.2758908 0.0093919 0.0055444 0.0092039 -0.3545401 -0.8915289 0.4753191 -0.0108971 0.6681909 -0.8718564 0.012565 -0.013396 0.0105817 -0.4366921 -1.0409418 -0.3162659 -0.003434 -0.3081618 -0.7315718 0.0022143 -0.0035246 0.0022136 -0.3108517 -0.086533 -0.2704691 0.0025396 -0.0000972 -0.1840797 0.00256 -0.0009464 -0.0001135 0.0108003 0.256691 -0.3000533 0.0056193 -0.2565103 -0.236818 0.0022067 0.0049881 0.0016822 0.1101659 0.3637971 0.3319704 -0.001394 0.0993169 1.1775879 -0.0134847 0.0016598 -0.0111681 0.0814312 -0.9280395 0.2054079 -0.0120471 -0.1998412 -0.1877634 -0.0001164 -0.0066095 0.0041597 -0.0298453 -0.3514438 0.4785605 -0.0080062 0.2996739 1.1617213 -0.0157384 -0.0060095 -0.0140157 -0.1948847 -0.0526067 0.0975907 -0.0002515 -0.0346792 0.0196337 -0.0027906 0.0013946 -0.0014753 -0.1557269 0.1849086 -0.1527848 0.0043854 0.2854604 -0.234654 0.0057839 -0.0014425 0.0011989 -0.0401967 -0.2035643 0.0818277 -0.0016706 0.1557463 0.033479 -0.0007258 -0.0026888 -0.0015599 -0.1453183 -0.03457 -0.1501492 0.0032331 -0.0715831 0.0437366 -0.0034155 0.0022176 -0.0042445 -0.1516858 0.1452318 0.0891616 0.0017807 -0.0016874 0.0435315 -0.002473 0.0029942 -0.0015244 -0.1388566 2.2886815 -0.1453017 0.0231909 -0.1112423 1.2511376 -0.0142571 0.0227456 -0.0147994 0.2348055 0.1510114 0.0565637 -0.0008753 0.0345495 0.0745225 0.0015464 -0.0005683 0.0017541 0.1588818 0.0479702 -0.121474 0.0005487 -0.0610849 -0.1180851 0.0030348 -0.0002429 0.0024391 0.1528166 0.0859941 -0.0265531 -0.0003865 -0.076601 0.0001075 0.0012726 0.0003006 0.0018484 0.1572231 0.0036505 0.0967829 -0.0029748 0.1084215 -0.0293275 0.0037418 -0.0031566 0.0036474 0.1647061 -0.1053957 -0.0242849 -0.0024437 -0.0387797 0.0839754 0.0006392 -0.0022738 0.0007919 0.1611394 0.1745708 0.1763818 -0.0040318 0.1203305 0.370496 0.0010731 -0.0032338 0.001506 0.3571182 0.2235627 -0.0966374 -0.0005457 -0.1988142 0.2585644 -0.0002249 0.0007344 0.0008248 0.3979684 unknown
polarizability: 219.646533|-3.4051215|187.5950403|1.7741583|-1.8519272|53.0199411 unknown
InChI: InChI=1S/C11H7BrO3/c12-9-5-8(11(14)15)10(13)7-4-2-1-3-6(7)9/h1-5,13-14H
charge 0 multiplicity 1
22 atoms
Br 0.873011 3.544075 -0.055426
O  -1.104521 -2.320784 0.003128
O  -3.709942 1.052251 -0.068409
O  -3.633284 -1.265965 -0.037369
C  0.811647 -0.759393 0.002402
C  1.29422 0.608865 -0.01093
C  -0.614087 -1.022926 -0.008981
C  -1.540029 0.044088 -0.032697
C  0.312953 1.658797 -0.035231
C  1.77237 -1.823166 0.02676
C  -1.045626 1.391358 -0.045575
C  2.70644 0.841857 0.000705
C  3.14479 -1.566121 0.037583
C  3.614519 -0.218582 0.024378
C  -3.009659 -0.180485 -0.045067
H  -1.780185 2.197918 -0.063934
H  1.454247 -2.87508 0.037787
H  3.064634 1.8754 -0.009382
H  3.859378 -2.395123 0.05622
H  4.690858 -0.018052 0.032931
H  -0.372611 -2.986487 0.018867
H  -4.682623 0.845754 -0.075861
