program: Gaussian 09
title: 000289385
version: EM64L-G09RevD.01
frameworkgroup: C1[X(C8H9ClN2O)]
method: RPBEPBE
basis: SDD
operation: Freq
keyword: #p
keyword: freq=noraman
keyword: PBEPBE/SDD
title: #p freq=noraman PBEPBE/SDD
converged: YES YES NO NO
title: Mulliken charges:
elementType: Cl O N N C C C C C C C C H H H H H H H H H
charge: -0.075583 -0.228567 -0.372109 -0.381468 0.575287 -0.318784 -0.327066 -0.215989 -0.213796 -0.252253 0.247754 -0.761511 0.240221 0.320038 0.251321 0.226185 0.319061 0.232991 0.259077 0.213978 0.261213
chargesum: 0.00000
title: Mulliken charges with hydrogens summed into heavy atoms:
elementType: Cl O N N C C C C C C C C
charge: -0.075583 -0.228567 -0.052070 -0.062407 0.575287 -0.318784 -0.086845 0.035332 0.012389 -0.019262 0.247754 -0.027244
polarizability: 1.43068953e+02 3.10223999e+00 1.23996964e+02 1.13901712e+01 -5.26178357e-02 6.81791413e+01
1716.lowfreq: -0.0031 -0.0021 -0.0014 3.2028 6.3610 8.4293 38.4773 43.1717 70.2573
frequency: 38.4319 43.1468 70.2464 97.4590 138.8073 190.4741 224.7950 265.9131 298.9675 367.3604 387.5768 432.2818 454.1881 487.4964 525.9008 542.9366 601.1019 615.2311 660.6779 696.4621 708.9037 749.1668 830.4533 845.5655 908.1929 928.0638 971.1316 974.9932 1007.5330 1036.1880 1038.1657 1117.6963 1161.6429 1170.2862 1231.3560 1273.2937 1322.6007 1375.5928 1385.9607 1432.8676 1445.4810 1450.0718 1460.9834 1469.1085 1495.2330 1580.5463 1616.9608 1644.7087 2998.1164 3099.5120 3103.7799 3136.9665 3153.4232 3163.2385 3177.5029 3495.4065 3516.3380
redmass: 5.4869 5.8378 2.5640 1.2917 4.7494 7.4452 5.6619 3.9916 3.1226 3.9632 8.3092 2.8820 1.6525 4.2463 1.8502 3.8305 3.4374 2.1121 5.6066 5.0479 3.8377 1.2488 4.4600 1.4018 3.9188 1.3630 1.3123 1.9474 7.0990 1.9681 1.6476 1.7826 1.9541 1.2592 1.9507 1.7869 2.7226 4.8363 1.2250 2.5607 1.5278 1.0558 1.8645 1.1099 1.9127 5.3980 6.7025 7.4375 1.0361 1.1003 1.0983 1.0856 1.0893 1.0946 1.1005 1.0772 1.0788
irintensity: 2.9014 2.2564 7.9585 0.5067 0.2168 5.4583 3.2017 5.7658 8.4261 1.9554 5.4757 17.2088 23.4030 17.8549 137.2568 1.9859 54.0697 18.6909 17.6940 5.1375 0.8709 101.9229 6.1316 3.1326 7.1076 2.8400 0.4009 13.8642 56.3955 8.1901 12.0081 7.0266 26.1273 15.2632 72.3333 45.4843 11.8585 33.9096 60.1277 12.0798 78.9262 18.2595 68.2919 16.7947 100.9937 9.8756 89.0679 162.3408 10.1981 18.4279 6.6765 3.6139 6.8125 14.7062 12.9767 32.1733 26.6408
temp: 298.150 k
press: 1.00000 atm
elementType: 17 8 7 7 6 6 6 6 6 6 6 6 1 1 1 1 1 1 1 1 1
symmnumber: 1
zpe: 416399.1 jmol-1
zpe.correction: 0.158598 hartree
zpe.thermalcorrener: 0.170493 hartree
zpe.thermalcorrenthalpy: 0.171437 hartree
zpe.thermalcorrgfe: 0.119020 hartree
zpe.sumelectzpe: -954.142291 hartree
zpe.sumelectthermal: -954.130396 hartree
zpe.sumelectthermalent: -954.129452 hartree
zpe.sumelectthermalfe: -954.181869 hartree
dipole: -1.9970 2.1977 -3.1402
dipole: 4.3219
quadrupole: -63.3146 -73.1857 -82.9921
quadrupole: -0.1404 11.0444 1.6890
quadrupole: 9.8495 -0.0216 -9.8279 -0.1404 11.0444 1.6890
hfenergy: -954.3008892 hartree
pointgroup: C01 [X(C8H9Cl1N2O1)]
dipole: 0.5881398 -1.2216976 -1.0260509 debye
dipolederiv: -0.1661532 -0.0261124 0.0238211 0.006859 -0.7329288 0.1451725 0.0274151 0.1432127 -0.1025704 -0.5723851 0.114575 0.0572381 -0.0596966 -0.5268174 -0.3069981 -0.2842801 -0.224576 -0.8011078 -0.7628326 -0.1524762 0.1762502 -0.3305006 -0.087493 0.069881 0.4446329 0.1971878 -0.5795347 -0.440141 -0.2068818 -0.2847819 -0.4784068 -0.2884924 0.1060338 -0.5649666 0.0030335 -0.4421788 1.08491 0.2850994 -0.3265066 0.6727439 -0.1662686 -0.0713325 -0.4168049 -0.0652564 0.2848565 -0.2490943 -0.1299835 0.0422394 0.0665395 1.0396751 -0.2811865 0.0164165 -0.1744073 -0.0713002 -0.1879264 0.066566 -0.0209 -0.3920345 -0.0509461 0.0602732 0.0759408 -0.0652352 -0.2030338 0.0519051 0.0683984 -0.0616467 -0.0204423 -0.0804944 0.0217331 -0.0430621 -0.0245153 -0.0606287 0.1480385 -0.1179439 -0.0617781 0.0357801 0.1251384 -0.0549129 -0.1080646 -0.0234022 -0.0999004 -0.1136584 0.0285966 -0.0507822 0.0364263 -0.1632829 -0.0273593 -0.0394515 -0.0167268 -0.1880572 1.1856713 -0.2340511 0.3147624 -0.0351603 0.506095 0.3478849 0.7990696 0.3608554 1.1586024 -0.4032978 0.1902428 0.0210139 0.1669906 -0.0865272 -0.0002076 -0.052291 0.0181338 0.0294347 0.0037005 0.0950277 0.0425022 0.1087792 0.0274878 0.0183968 0.0341956 0.0083237 0.1392435 0.0966515 -0.0061739 0.0135251 0.0161243 0.1911883 -0.0203951 -0.0462533 -0.0962072 0.3192339 0.013429 0.0735302 0.0275722 0.0886752 0.0412834 -0.0045219 0.0291259 0.0002047 0.1543453 0.0915316 -0.0025254 0.0186655 -0.0231586 -0.110113 0.0559353 0.0271171 0.0550474 0.1399326 0.1114428 0.0771978 0.0059677 0.210259 0.2146824 -0.064967 -0.0252723 -0.0746195 0.1568058 -0.0582099 -0.0583746 0.080565 -0.0579142 0.0444909 0.0446421 0.0847058 0.0443871 0.1399281 -0.0325411 -0.0625759 0.0046366 -0.0946056 0.0316868 -0.0102474 0.0136305 -0.0287318 0.1193563 0.0842165 0.0016219 -0.038828 0.037387 0.0372663 -0.0983296 0.0281137 -0.1259448 -0.092295 0.1147428 -0.0037572 0.0164639 0.0453554 0.0343694 0.0705051 0.0000828 0.0892363 -0.0011322 unknown
polarizability: 142.7116079|-2.9767098|121.9775077|-13.4247092|-9.2105761|70.5559435 unknown
InChI: InChI=1S/C8H9ClN2O/c1-6(12)10-11-8-5-3-2-4-7(8)9/h2-5,10-11H,1H3
charge 0 multiplicity 1
21 atoms
Cl -1.546645 2.631712 -0.567148
O  2.503093 0.612177 1.189792
N  0.647481 0.574887 -0.928773
N  1.839513 -0.15397 -0.909541
C  -0.531403 0.02188 -0.383407
C  -1.675568 0.839754 -0.184528
C  -0.65295 -1.358363 -0.068046
C  -2.889237 0.334313 0.303747
C  -1.86821 -1.879862 0.420633
C  -2.99268 -1.043613 0.608043
C  2.736015 -0.089551 0.169586
C  4.002099 -0.918115 -0.019964
H  0.21965 -2.005841 -0.196789
H  0.749915 1.592948 -0.870288
H  -3.739485 1.008156 0.444718
H  -1.934002 -2.946539 0.66096
H  2.085514 -0.65435 -1.766871
H  -3.935566 -1.447666 0.988649
H  4.88048 -0.251387 0.01911
H  4.024011 -1.483065 -0.968169
H  4.090475 -1.628105 0.819786
