program: Gaussian 09
title: 000289417
version: EM64L-G09RevD.01
frameworkgroup: C1[X(C12H10FNO5S)]
method: RPBEPBE
basis: SDD
operation: Freq
keyword: #p
keyword: freq=noraman
keyword: PBEPBE/SDD
title: #p freq=noraman PBEPBE/SDD
converged: YES YES NO NO
title: Mulliken charges:
elementType: S F O O O O O N C C C C C C C C C C C C H H H H H H H H H H
charge: 1.086546 -0.344187 -0.322134 -0.232129 -0.478517 -0.467412 -0.199000 -0.447263 0.184276 0.302585 -0.328685 -0.164430 0.194653 -0.373743 0.149918 -0.183491 -0.380630 0.187187 -0.217464 -0.672261 0.328576 0.360642 0.255558 0.291800 0.295106 0.242416 0.241908 0.227937 0.230822 0.231414
chargesum: 0.00000
title: Mulliken charges with hydrogens summed into heavy atoms:
elementType: S F O O O O O N C C C C C C C C C C C C
charge: 1.086546 -0.344187 -0.322134 -0.232129 -0.478517 -0.467412 -0.199000 -0.086620 0.184276 0.302585 -0.000109 -0.164430 0.194653 -0.118185 0.149918 0.108309 -0.085523 0.187187 0.266860 0.017912
polarizability: 2.96841666e+02 -5.76020156e+00 2.03243076e+02 -4.24040663e+00 2.19193614e+00 9.15546501e+01
1716.lowfreq: -7.0077 -4.8548 -1.5615 -0.0015 0.0012 0.0015 22.8618 29.0080 36.1566
frequency: 22.4795 28.9817 36.1501 63.1156 66.8543 92.0398 106.8798 121.7715 154.8796 179.7643 188.6395 192.5463 205.9265 229.4190 246.7444 267.1036 292.1295 299.8308 340.7894 362.3232 378.4384 400.7478 430.0201 449.6756 502.5072 519.7744 522.6937 544.3461 563.2644 579.6644 634.7433 676.2803 712.3182 722.3599 739.2094 776.1282 777.8130 797.8965 823.0656 831.0384 849.2700 863.4375 910.4352 949.9154 951.9692 969.5970 996.9282 1020.8291 1046.9412 1057.3509 1084.9713 1113.0001 1137.7384 1149.6214 1196.3604 1238.1020 1243.6946 1252.2632 1285.2304 1334.2898 1365.9507 1398.2249 1403.9763 1415.8916 1459.7244 1465.4320 1473.4166 1485.2418 1503.9891 1548.4749 1576.6471 1602.4029 1628.0883 1649.3294 2998.5307 3019.4488 3079.1049 3095.8373 3110.5759 3142.8737 3146.5361 3171.8212 3192.2501 3518.9086
redmass: 4.8238 4.9956 6.1741 4.9182 4.2235 6.2756 8.3158 5.0421 4.1017 8.0007 4.6811 5.8851 6.9005 8.9977 1.3832 12.1973 8.2845 7.8467 5.9885 7.3728 8.1189 5.5883 3.6171 11.2899 6.4366 6.4093 9.0747 6.8428 6.2900 5.1913 7.9578 3.4994 1.2346 7.5613 7.2719 6.0127 3.0836 1.1066 3.7728 1.6421 8.9020 8.4670 1.4874 6.0657 1.3928 1.3710 17.3549 2.3898 2.4371 3.8913 3.0265 2.2494 1.4693 1.3624 2.9936 2.0394 1.6855 1.1274 2.1367 1.8871 1.5282 3.2934 1.3458 7.4561 2.5832 1.0402 1.0627 1.0723 4.8803 9.5346 4.9379 8.0696 6.8592 11.6693 1.0360 1.0583 1.1064 1.0984 1.1039 1.0902 1.0925 1.0966 1.0930 1.0777
irintensity: 0.0629 1.7721 1.3192 0.3317 0.5721 0.9855 2.8621 0.8705 3.8430 3.3396 2.3653 1.1687 0.7180 1.2620 1.0245 11.3439 7.7491 4.6667 42.5810 3.2679 8.5200 25.0678 5.7774 43.2609 10.9230 23.7014 9.4891 38.6435 113.8900 0.7581 20.8424 0.7722 67.0388 6.3246 8.4745 2.8904 2.2626 3.7533 6.5156 67.9085 59.1379 64.3636 35.9189 78.8154 7.0617 4.7887 80.9081 99.5763 15.7703 129.7389 29.4492 6.8987 6.3363 98.0871 384.0056 8.3045 32.0600 0.1812 0.2749 40.8080 9.3594 38.6489 13.4598 11.6125 15.7039 14.4184 6.8729 7.4939 308.6330 144.3489 17.9624 122.6616 79.5558 143.2044 14.1105 13.7987 1.8586 25.2379 40.2145 1.8639 15.6262 5.2478 4.1618 163.1355
temp: 298.150 k
press: 1.00000 atm
elementType: 16 9 8 8 8 8 8 7 6 6 6 6 6 6 6 6 6 6 6 6 1 1 1 1 1 1 1 1 1 1
symmnumber: 1
zpe: 538229.7 jmol-1
zpe.correction: 0.205001 hartree
zpe.thermalcorrener: 0.224239 hartree
zpe.thermalcorrenthalpy: 0.225183 hartree
zpe.thermalcorrgfe: 0.155128 hartree
zpe.sumelectzpe: -1390.458329 hartree
zpe.sumelectthermal: -1390.439090 hartree
zpe.sumelectthermalent: -1390.438146 hartree
zpe.sumelectthermalfe: -1390.508202 hartree
dipole: -10.5333 -6.7997 -0.6543
dipole: 12.5545
quadrupole: -137.4803 -132.0578 -126.4050
quadrupole: 16.8243 -1.9429 0.2504
quadrupole: -5.4993 -0.0767 5.5760 16.8243 -1.9429 0.2504
hfenergy: -1390.6633294 hartree
pointgroup: C01 [X(C12H10F1N1O5S1)]
dipole: 4.1223173 2.7112635 -0.2289394 debye
polarizability: 296.9482929|-5.086198|203.197564|3.6103751|-0.4967847|91.4935354 unknown
InChI: InChI=1S/C12H10FNO5S/c1-2-19-12(16)10-6-11(15)8-5-7(20(13,17)18)3-4-9(8)14-10/h3-6,14H,2H2,1H3
charge 0 multiplicity 1
30 atoms
S  -4.616936 0.444832 -0.106903
F  -4.883344 0.653299 1.723908
O  3.999578 0.809804 0.015839
O  -0.507637 -3.189045 -0.054391
O  -5.161018 1.804494 -0.770616
O  -5.196817 -1.0008 -0.49254
O  4.457603 -1.486602 0.01662
N  1.410891 0.497875 -0.026017
C  -0.665384 -0.766463 -0.0520
C  0.020611 0.491209 -0.044066
C  -2.081229 -0.780368 -0.061731
C  -2.751043 0.441435 -0.078867
C  2.150933 -0.681282 -0.014025
C  -0.706119 1.718622 -0.061022
C  0.086206 -2.061296 -0.043039
C  -2.104795 1.700087 -0.075655
C  1.545064 -1.923104 -0.021884
C  3.641333 -0.54202 0.007267
C  5.471164 1.106906 0.03923
C  5.622963 2.622386 0.064989
H  -2.59472 -1.749031 -0.064572
H  1.937301 1.376426 -0.018465
H  -0.172081 2.674954 -0.058985
H  -2.68714 2.626034 -0.09706
H  2.165453 -2.822422 -0.013469
H  5.89748 0.617879 0.932876
H  5.919687 0.64632 -0.858728
H  6.696574 2.882686 0.08236
H  5.173762 3.084462 -0.830665
H  5.151561 3.055823 0.963511
