program: Gaussian 09
title: 000289388
version: EM64L-G09RevD.01
frameworkgroup: C1[X(C8H12N2O5)]
method: RPBEPBE
basis: SDD
operation: Freq
keyword: #p
keyword: freq=noraman
keyword: PBEPBE/SDD
title: #p freq=noraman PBEPBE/SDD
converged: YES YES NO NO
title: Mulliken charges:
elementType: O O O O O N N C C C C C C C C H H H H H H H H H H H H
charge: -0.255076 -0.204531 -0.220497 -0.264901 -0.228992 -0.055223 0.120859 -0.097468 -0.441771 -0.508513 -0.495767 0.210780 -0.390433 0.275524 -0.500583 0.282486 0.251790 0.247500 0.256803 0.263304 0.249661 0.245644 0.263677 0.268216 0.237453 0.243568 0.246490
chargesum: 0.00000
title: Mulliken charges with hydrogens summed into heavy atoms:
elementType: O O O O O N N C C C C C C C C
charge: -0.255076 -0.204531 -0.220497 -0.264901 -0.228992 -0.055223 0.120859 0.185018 0.057519 0.011594 -0.000463 0.210780 0.141460 0.275524 0.226928
polarizability: 1.52954807e+02 -7.40243816e+00 1.10775172e+02 4.62513777e+00 -2.51624019e+00 9.63059884e+01
1716.lowfreq: -10.3046 -4.4544 -0.0005 -0.0002 0.0005 8.3685 19.8140 24.7056 39.4299
frequency: 19.7026 24.6461 39.3470 63.4177 76.2639 93.2181 137.6139 161.2238 168.0957 206.3152 237.6688 245.1002 271.3459 315.3945 326.5937 365.7938 455.4845 514.0603 522.9589 530.5731 541.7643 619.4950 660.8674 669.5328 715.7198 757.1898 817.8448 839.9860 884.0127 921.9712 925.8855 937.9530 985.4792 1006.6651 1016.1751 1077.0214 1093.9719 1102.8460 1113.6698 1142.5310 1149.3696 1163.5448 1182.2668 1214.0610 1219.2227 1239.2822 1252.5806 1262.0999 1309.8565 1318.6788 1333.3677 1347.3877 1359.5394 1418.0081 1424.1509 1424.2935 1450.8996 1454.1582 1462.6356 1463.9549 1478.2550 1660.1494 1672.9011 2994.4008 3004.6914 3007.8875 3018.9568 3036.8358 3050.3737 3066.3348 3069.3455 3090.3659 3111.2975 3113.6325 3154.2062
redmass: 5.0132 11.8264 5.3912 3.6231 3.9288 1.2582 4.4181 2.9328 3.3579 3.7747 3.4336 3.7047 6.5018 5.0074 3.2497 4.8710 3.3225 4.3319 3.2285 3.8754 4.1302 5.9551 7.2018 6.8330 6.0731 3.7313 2.0016 6.1806 3.2263 4.1433 1.9697 2.9089 2.8641 2.8155 3.3159 2.4303 3.2650 2.6583 1.2633 4.1796 1.4312 1.3427 2.2088 2.8671 1.8233 1.2271 1.5650 1.3091 1.3446 1.2861 1.4874 1.4881 1.7249 1.1158 1.1721 3.6271 1.0961 1.0499 1.0841 1.0507 1.0870 8.4599 9.2805 1.0605 1.0632 1.0295 1.0610 1.0580 1.0982 1.0966 1.0943 1.1018 1.1048 1.1041 1.1050
irintensity: 0.6881 0.1973 0.3667 3.4004 5.8982 0.6743 5.1698 5.2205 1.5151 8.4961 12.4375 12.7338 3.9973 11.5109 2.6942 2.9585 3.4654 1.4508 1.0300 2.6940 3.8597 17.0177 11.7421 16.1756 4.2878 26.0922 21.2716 3.6477 24.3131 14.4431 9.9019 2.9398 7.9426 17.7091 58.0521 20.5529 22.0951 19.3662 0.4509 461.5157 6.9816 7.5066 90.5501 34.5269 128.7532 29.8431 28.0774 10.0674 10.9941 4.7693 12.6084 35.5061 58.1787 54.6360 11.9485 117.3554 24.6774 14.3674 8.8274 11.0895 17.0064 172.5015 198.0047 18.5153 10.6953 30.4068 11.8173 18.7328 7.5642 11.0749 0.8606 16.2444 22.2284 5.2095 14.9250
temp: 298.150 k
press: 1.00000 atm
elementType: 8 8 8 8 8 7 7 6 6 6 6 6 6 6 6 1 1 1 1 1 1 1 1 1 1 1 1
symmnumber: 1
zpe: 541815.0 jmol-1
zpe.correction: 0.206366 hartree
zpe.thermalcorrener: 0.221711 hartree
zpe.thermalcorrenthalpy: 0.222656 hartree
zpe.thermalcorrgfe: 0.160669 hartree
zpe.sumelectzpe: -796.409538 hartree
zpe.sumelectthermal: -796.394193 hartree
zpe.sumelectthermalent: -796.393249 hartree
zpe.sumelectthermalfe: -796.455236 hartree
dipole: -4.2826 1.4147 -0.0528
dipole: 4.5105
quadrupole: -95.3288 -83.7247 -90.3080
quadrupole: 14.5481 4.7419 1.9778
quadrupole: -5.5416 6.0625 -0.5209 14.5481 4.7419 1.9778
hfenergy: -796.6159045 hartree
pointgroup: C01 [X(C8H12N2O5)]
dipole: 1.6258095 0.2328992 0.6720475 debye
polarizability: 150.3175416|-2.0679898|98.210586|13.6513715|5.0119938|111.50784 unknown
InChI: InChI=1S/C8H12N2O5/c1-14-8(11)5-15-7-3-2-6(4-9-7)10(12)13/h6H,2-5H2,1H3
charge 0 multiplicity 1
27 atoms
O  1.265391 0.86188 1.615705
O  -3.758016 -0.215501 -2.446925
O  -4.237336 -0.908641 -0.323195
O  4.122121 -0.913992 0.150352
O  2.77917 0.755134 -0.777705
N  -0.004212 -0.674349 0.385706
N  -3.474141 -0.344699 -1.197272
C  -2.124477 0.173644 -0.71939
C  -2.297179 1.1111 0.494727
C  -0.904694 1.629029 0.919781
C  -1.229093 -1.046966 -0.340403
C  0.105611 0.499317 0.923477
C  2.383736 -0.079848 1.535104
C  3.072108 0.001147 0.170488
C  4.910568 -0.963016 -1.107123
H  -1.69921 0.71266 -1.582441
H  -2.771115 0.545094 1.316219
H  -2.959569 1.957124 0.241919
H  -0.94309 2.081213 1.926329
H  -0.539974 2.417953 0.234492
H  -1.820312 -1.743069 0.286316
H  -0.933899 -1.592102 -1.254659
H  3.083304 0.226886 2.328539
H  2.045903 -1.11661 1.704019
H  5.660482 -1.747432 -0.936883
H  5.389037 0.012993 -1.293547
H  4.253688 -1.215447 -1.955932
