program: Gaussian 09
title: 000289377
version: EM64L-G09RevD.01
frameworkgroup: C1[X(C14H18O2)]
method: RPBEPBE
basis: SDD
operation: Freq
keyword: #pfreq=noraman
keyword: PBEPBE/SDD
title: #p freq=noraman PBEPBE/SDD
converged: YES YES NO NO
title: Mulliken charges:
elementType: O O C C C C C C C C C C C C C C H H H H H H H H H H H H H H H H H H
charge: -0.417717 -0.230302 0.002994 -0.471271 -0.603200 -0.438680 -0.568242 0.286224 0.289832 -0.388828 -0.396389 -0.400453 -0.490351 -0.252143 -0.249001 0.169560 0.213906 0.204310 0.211644 0.213473 0.234626 0.197159 0.193787 0.220721 0.222078 0.236488 0.217105 0.232371 0.229640 0.253009 0.252040 0.225003 0.224856 0.375749
chargesum: 0.00000
title: Mulliken charges with hydrogens summed into heavy atoms:
elementType: O O C C C C C C C C C C C C C C
charge: -0.041968 -0.230302 0.216899 -0.055317 -0.155100 -0.047734 -0.125443 0.286224 0.289832 0.064766 -0.164017 -0.170813 0.014698 -0.027140 -0.024145 0.169560
polarizability: 1.99610879e+02 7.63106936e+00 1.56087479e+02 8.07139132e+00 -3.06789996e+00 9.51283131e+01
1716.lowfreq: -11.4670 -6.1657 -1.8178 -0.0006 0.0002 0.0007 17.4692 32.0965 43.8239
frequency: 17.3252 31.9462 43.8084 68.6337 83.7139 102.7229 136.4107 171.7419 203.3995 221.2321 253.7133 304.5138 378.4702 404.8884 421.5288 442.6867 469.2342 492.5167 503.9124 506.8710 579.4125 587.8290 622.3780 639.4851 709.2933 722.9483 735.8844 750.1304 803.2491 835.3132 839.7319 864.3871 876.7007 894.7622 912.5532 955.0429 979.3005 984.5002 1007.5740 1028.5389 1037.7270 1052.2408 1075.8077 1085.5727 1095.0195 1115.7297 1127.1567 1140.0550 1146.6408 1172.6725 1195.7826 1205.3932 1219.6422 1234.5719 1237.6243 1254.2080 1267.3652 1276.0819 1290.8928 1303.8903 1307.5653 1336.6902 1344.9802 1350.5021 1364.5495 1371.7889 1382.6967 1435.9816 1439.8642 1450.5015 1457.8662 1458.6870 1470.1669 1479.5243 1490.2231 1591.5501 1613.7079 1669.0047 2936.9908 2943.3230 2951.8146 2956.4220 2969.7086 2984.4378 2995.1602 2997.4835 3018.2490 3021.5155 3030.6193 3033.9890 3063.5918 3107.6579 3111.8850 3133.9162 3156.8298 3510.2712
redmass: 9.5016 4.2342 4.7779 2.4649 2.3550 2.7086 2.8535 3.9678 5.5628 2.2267 2.5685 3.6022 3.6599 4.3106 2.1795 2.5193 3.3743 2.9490 2.0796 3.5368 3.9191 4.7848 3.4341 1.3147 3.1632 2.7480 1.4171 1.2221 1.9439 1.9098 2.3901 3.1198 1.5311 1.6165 2.1144 1.4121 2.2940 1.3313 2.4282 2.5621 2.3412 2.6153 2.1549 2.5152 2.0021 1.7431 2.0760 1.1749 1.4609 1.0616 2.4435 1.4021 1.7559 1.4000 1.3374 1.4133 1.4008 1.2713 1.1099 1.4139 1.3514 1.4673 1.5426 1.5562 1.8286 1.7981 4.6890 1.0869 2.3613 1.1486 1.0846 1.0952 1.0926 1.0958 2.2706 6.5486 6.4144 8.2399 1.0700 1.0605 1.0755 1.0649 1.0631 1.0616 1.0732 1.0861 1.0935 1.0941 1.0979 1.1019 1.1025 1.0864 1.0892 1.0925 1.1004 1.0639
irintensity: 1.0122 0.0021 0.1098 0.5306 0.1766 0.3153 0.2097 1.0365 0.4627 0.6095 6.3131 1.7737 0.6264 13.5798 4.6089 4.1769 4.0202 22.3643 26.2417 2.2217 2.1115 8.6549 4.9953 128.1993 0.9247 6.1300 14.3141 63.5214 11.2768 3.9559 2.5630 2.2072 0.1453 3.8591 6.2147 4.2066 5.8518 0.2417 105.5138 72.8925 61.0057 5.1967 40.2230 28.4434 3.2832 4.8459 12.4900 5.8110 0.7848 0.3007 0.8379 6.2706 2.0218 2.9051 2.9088 6.1175 20.1809 5.7998 2.2670 10.6068 3.8407 9.0859 4.3289 23.8690 0.3146 19.9402 0.8147 26.2480 4.1380 5.2911 11.0556 4.4539 6.1585 18.0120 21.4276 3.5608 0.9255 199.4959 14.7012 20.2247 17.9165 29.0906 57.1900 5.8361 24.1672 26.2717 54.9906 9.8093 3.4433 69.7109 54.8774 17.8644 2.1234 30.6410 37.2144 19.0026
temp: 298.150 k
press: 1.00000 atm
elementType: 8 8 6 6 6 6 6 6 6 6 6 6 6 6 6 6 1 1 1 1 1 1 1 1 1 1 1 1 1 1 1 1 1 1
symmnumber: 1
zpe: 754018.7 jmol-1
zpe.correction: 0.287191 hartree
zpe.thermalcorrener: 0.302478 hartree
zpe.thermalcorrenthalpy: 0.303422 hartree
zpe.thermalcorrgfe: 0.242092 hartree
zpe.sumelectzpe: -693.559604 hartree
zpe.sumelectthermal: -693.544317 hartree
zpe.sumelectthermalent: -693.543373 hartree
zpe.sumelectthermalfe: -693.604703 hartree
dipole: 0.6473 1.8101 0.5713
dipole: 2.0054
quadrupole: -88.8457 -95.1079 -98.3027
quadrupole: 1.1496 2.6093 -4.1111
quadrupole: 5.2398 -1.0225 -4.2173 1.1496 2.6093 -4.1111
hfenergy: -693.8467948 hartree
pointgroup: C01 [X(C14H18O2)]
dipole: -0.2553965 -0.7135733 0.2193212 debye
polarizability: 199.5905859|7.6255376|155.9987897|-8.322337|3.591527|95.237295 unknown
InChI: InChI=1S/C14H18O2/c15-14(16)7-3-4-11-8-9-12-5-1-2-6-13(12)10-11/h1-2,5-6,11,15H,3-4,7-10H2
charge 0 multiplicity 1
34 atoms
O  -6.297951 0.135846 0.188509
O  -4.763416 1.680098 -0.616864
C  -0.071414 -0.96934 -0.155681
C  0.852966 -2.146968 0.238503
C  0.51471 0.346671 0.412328
C  -1.525162 -1.216456 0.315994
C  2.25419 -1.984472 -0.385978
C  2.016596 0.510025 0.18184
C  2.844475 -0.594065 -0.16605
C  -2.532787 -0.130164 -0.121538
C  2.608227 1.789865 0.340757
C  4.237632 -0.387246 -0.334365
C  -3.977234 -0.50538 0.259651
C  3.994156 1.987571 0.169141
C  4.817426 0.887946 -0.170078
C  -4.990588 0.55888 -0.112768
H  -0.073858 -0.899857 -1.265798
H  0.407458 -3.106848 -0.088922
H  0.934981 -2.186583 1.344458
H  0.314368 0.372026 1.506135
H  -0.012671 1.220971 -0.014613
H  -1.534079 -1.306345 1.423846
H  -1.85944 -2.199276 -0.078914
H  2.18403 -2.175539 -1.477729
H  2.946269 -2.750211 0.014785
H  -2.280589 0.84276 0.338145
H  -2.468907 0.021328 -1.216657
H  1.96748 2.64199 0.602665
H  4.873481 -1.242509 -0.598078
H  -4.064815 -0.684539 1.350121
H  -4.28654 -1.453948 -0.221067
H  4.428301 2.985625 0.296787
H  5.896472 1.024749 -0.303962
H  -6.937967 0.857394 -0.059901
