program: Gaussian 09
title: 000289371
version: EM64L-G09RevD.01
frameworkgroup: C1[X(C9H9ClN2O4)]
method: RPBEPBE
basis: SDD
operation: Freq
keyword: #p
keyword: freq=noraman
keyword: PBEPBE/SDD
title: #p freq=noraman PBEPBE/SDD
converged: NO YES NO NO
title: Mulliken charges:
elementType: Cl O O O O N N C C C C C C C C C H H H H H H H H H
charge: 0.029890 -0.450973 -0.198054 -0.267599 -0.223665 -0.380343 0.022272 0.340930 0.255033 -0.341905 -0.262318 -0.469471 0.414463 -0.393372 -0.710115 0.101948 0.363402 0.231049 0.231024 0.281932 0.337645 0.232044 0.232039 0.232379 0.391766
chargesum: 0.00000
title: Mulliken charges with hydrogens summed into heavy atoms:
elementType: Cl O O O O N N C C C C C C C C C
charge: 0.029890 -0.059207 -0.198054 -0.267599 -0.223665 -0.016941 0.022272 0.340930 0.255033 0.120167 0.019614 -0.131826 0.414463 -0.393372 -0.013653 0.101948
polarizability: 2.27641638e+02 -5.22815310e+00 1.80767920e+02 5.84223092e-03 1.20837742e-02 6.15445213e+01
1716.lowfreq: -9.3605 -3.2938 -2.9288 -0.0018 -0.0017 0.0013 24.7050 37.0810 61.1088
frequency: 24.5283 37.0774 61.1039 84.0884 110.1871 112.8795 163.7113 166.1227 204.1472 219.1530 260.2841 269.2582 305.3725 324.2308 335.4151 367.9447 387.3313 448.0618 468.9527 531.0279 566.6829 598.6592 612.0506 640.0403 659.4216 676.7964 711.8536 715.3367 749.2348 768.9282 811.5962 816.9382 855.7565 908.8958 954.2619 972.4739 1010.5915 1072.1496 1080.7441 1136.5765 1139.8846 1148.7513 1191.6661 1254.6893 1272.5947 1273.2991 1308.0810 1329.6494 1357.4065 1380.5947 1403.9640 1450.8102 1457.0657 1478.0626 1481.5251 1492.3206 1512.4655 1560.7687 1629.6652 1652.2213 2956.7005 2995.2538 3001.1036 3092.5706 3102.1815 3190.5976 3195.2179 3330.4443 3538.5366
redmass: 14.0707 5.4545 7.2633 3.7298 4.0844 3.2705 9.3072 2.6768 12.4371 4.6644 1.3798 6.8601 6.1479 11.7774 7.0432 5.5222 9.3991 3.1742 6.0238 7.4335 1.4304 5.6439 3.8167 5.5989 4.8261 7.2273 3.4666 8.0058 6.3615 1.2728 1.1469 5.2226 1.4972 2.7057 4.4480 1.4100 4.1128 2.9119 3.1060 2.2187 1.4975 2.4499 4.3083 1.9633 1.5559 1.1096 2.7968 7.2869 1.4002 3.9372 1.2326 5.3136 2.6742 1.0387 1.0767 1.1167 5.9141 3.0485 7.8331 9.0718 1.0579 1.0364 1.1041 1.1012 1.0993 1.0911 1.0913 1.0788 1.0644
irintensity: 0.9871 1.2576 0.3445 1.1114 0.3531 0.0080 4.2362 0.7419 1.7322 1.2874 0.1136 1.7826 1.1652 3.4543 9.2092 4.7242 0.4290 11.7106 13.9764 25.0657 92.4941 53.8386 16.0771 18.8905 61.4107 1.2225 4.8198 5.5587 4.3385 96.8451 16.4491 8.8849 9.8573 19.6567 98.3271 19.3443 226.0655 0.8900 31.4457 112.8953 2.5177 149.6206 285.7342 16.0553 8.7450 0.0246 38.1874 293.0448 18.6636 121.1059 22.3612 0.0200 10.9139 14.4282 39.4381 33.9677 39.9918 167.5013 556.7891 346.3032 37.4549 21.6643 23.7781 32.8741 25.2230 0.4308 17.2283 96.8331 63.1555
temp: 298.150 k
press: 1.00000 atm
elementType: 17 8 8 8 8 7 7 6 6 6 6 6 6 6 6 6 1 1 1 1 1 1 1 1 1
symmnumber: 1
zpe: 462823.0 jmol-1
zpe.correction: 0.176280 hartree
zpe.thermalcorrener: 0.191609 hartree
zpe.thermalcorrenthalpy: 0.192553 hartree
zpe.thermalcorrgfe: 0.131906 hartree
zpe.sumelectzpe: -1217.578212 hartree
zpe.sumelectthermal: -1217.562883 hartree
zpe.sumelectthermalent: -1217.561939 hartree
zpe.sumelectthermalfe: -1217.622587 hartree
dipole: -3.0791 -3.4267 -0.0024
dipole: 4.6069
quadrupole: -94.4810 -108.2060 -99.2672
quadrupole: 24.2934 0.0054 -0.0116
quadrupole: 6.1704 -7.5546 1.3842 24.2934 0.0054 -0.0116
hfenergy: -1217.7544923 hartree
pointgroup: C01 [X(C9H9Cl1N2O4)]
dipole: 1.2957721 1.2665431 0.0443396 debye
dipolederiv: -0.220488 0.2410161 0.0014212 0.3762653 -0.6170203 -0.0057287 0.0041405 -0.0079944 -0.0148167 -0.6077012 -0.3586603 -0.009687 -0.663831 -1.0490667 -0.0222672 -0.0155917 -0.0177751 -0.4300062 -0.4001268 -0.257101 -0.0081882 -0.0219314 -1.111142 -0.0180476 -0.0030163 -0.0195172 -0.2234401 -0.9672344 0.2799508 -0.0051486 0.034481 -0.4632522 -0.0032314 -0.0114759 0.0012593 -0.267224 -1.1781527 0.2432668 -0.0088876 0.1975729 -0.63019 -0.0031382 -0.0101106 -0.0021276 -0.311158 -1.6272276 -0.4593084 -0.0288232 -0.1433636 -0.4219846 -0.0031737 -0.0226289 -0.0081822 -0.3765404 1.1867621 -0.4329081 0.0073973 -0.3916899 1.9048662 0.0271691 0.008456 0.0244602 0.1927603 1.5488297 0.416238 0.0302798 -0.2419243 0.316813 -0.0007608 0.0178425 0.0096249 0.1571345 -0.7665797 0.5755839 -0.0008831 -0.0429435 -0.8371106 -0.0164064 -0.0125426 -0.0071479 -0.0167867 0.5024347 0.2295755 0.0072028 0.500779 0.4944227 0.0112547 0.0126461 0.0071098 0.3280085 -0.9087057 -0.0377816 -0.0125107 0.4985651 -0.130335 0.0085888 -0.0021092 0.0001139 -0.1653101 0.6926237 -0.6315622 -0.0005844 -0.2540385 0.1146874 -0.0008496 0.006935 -0.0070376 -0.04493 -1.1693906 0.1008639 -0.0169005 0.0820824 -0.8147513 -0.0148901 -0.0169618 -0.0147474 0.0205754 0.9371505 -0.0930014 0.0138855 -0.1739506 1.3191017 0.0238907 0.0123422 0.0252754 -0.0532746 -0.0580226 -0.014259 -0.0024777 -0.0832601 0.0157021 -0.0024367 -0.0038239 -0.0013554 0.0731488 2.2452068 0.1453619 0.03448 0.3712401 1.2902973 0.0262119 0.0389558 0.0228226 0.2305174 0.2598901 -0.0120356 -0.0009193 0.0210359 0.2940445 0.0002793 -0.0003976 -0.0003903 0.2984155 -0.0152044 0.0304244 -0.0786221 -0.1037979 -0.0647017 0.0701199 -0.0245383 0.1116948 -0.0626268 -0.0186073 0.0310578 0.0814554 -0.1022267 -0.0574899 -0.073241 0.0220326 -0.110564 -0.0662539 0.0683954 -0.0512797 -0.0025225 -0.0479883 0.0060597 -0.0038531 -0.002625 -0.0039367 0.1642112 0.1724888 0.0413411 0.0009067 -0.0251661 0.1123657 -0.0014696 -0.0004465 -0.0002859 0.1655757 0.073787 0.0191312 -0.0192485 0.0956212 0.0430744 0.1102216 -0.050816 0.0951108 -0.0560977 0.071181 0.0213694 0.0244066 0.0970198 0.0508601 -0.1029286 0.0589606 -0.0903201 -0.0613506 -0.0020116 -0.0834589 -0.0036107 -0.1436019 -0.0897961 -0.0064439 -0.0047858 -0.0054479 0.1186241 0.180703 0.0561751 -0.0024212 0.1650508 0.3245456 0.0011306 -0.0004412 -0.0006422 0.4008445 unknown
polarizability: 226.7310053|-8.2524431|181.5969495|2.464789|2.1927149|61.6261251 unknown
InChI: InChI=1S/C9H9ClN2O4/c1-2-11-7-4-6(10)5(9(13)14)3-8(7)12(15)16/h3-4,11,13H,2H2,1H3
charge 0 multiplicity 1
25 atoms
Cl -2.061219 2.965629 -0.045541
O  -3.590886 -1.422386 -0.154454
O  0.587923 -3.268219 -0.123794
O  2.531768 -2.084872 -0.070173
O  -4.143454 0.827655 -0.120113
N  2.477195 0.540388 -0.02075
N  1.218891 -2.144315 -0.094131
C  1.119846 0.396223 -0.045294
C  0.463936 -0.896179 -0.081111
C  3.181148 1.832689 0.016094
C  0.256116 1.540765 -0.036696
C  -0.939609 -0.998278 -0.105242
C  -1.781277 0.134437 -0.096141
C  -1.132184 1.4123 -0.061133
C  4.701702 1.608263 0.037012
C  -3.253928 -0.053207 -0.122426
H  3.007708 -0.347046 -0.029525
H  2.901184 2.439616 -0.869566
H  2.871506 2.40492 0.914876
H  0.690052 2.541745 -0.010169
H  -1.388212 -1.99352 -0.131957
H  5.007295 1.029885 0.926976
H  5.037211 1.064926 -0.864172
H  5.226846 2.57791 0.064676
H  -4.581855 -1.499925 -0.171848
