program: Gaussian 09
title: 000289467
version: EM64L-G09RevD.01
frameworkgroup: C1[X(C14H23N5O3)]
method: RPBEPBE
basis: SDD
operation: Freq
keyword: #p
keyword: freq=noraman
keyword: PBEPBE/SDD
title: #p freq=noraman PBEPBE/SDD
converged: YES YES NO NO
title: Mulliken charges:
elementType: O O O N N N N N C C C C C C C C C C C C C C H H H H H H H H H H H H H H H H H H H H H H H
charge: -0.296385 -0.295433 -0.273960 -0.484013 -0.285488 -0.225645 -0.688504 -0.647461 0.551804 0.020558 0.305425 0.313343 -0.508384 -0.688425 -0.084059 -0.693439 -0.678491 0.255502 0.255028 -0.518540 -0.527489 -0.534732 0.334456 0.228153 0.169270 0.290014 0.199339 0.226490 0.209151 0.204190 0.220090 0.221678 0.219329 0.224287 0.248291 0.211780 0.265384 0.222110 0.244704 0.222631 0.216848 0.275859 0.427962 0.329639 0.317133
chargesum: 0.00000
title: Mulliken charges with hydrogens summed into heavy atoms:
elementType: O O O N N N N N C C C C C C C C C C C C C C
charge: -0.296385 -0.295433 -0.273960 -0.193999 -0.285488 -0.225645 0.015316 -0.000689 0.551804 0.020558 0.305425 0.313343 -0.173927 -0.460272 0.085211 -0.058459 -0.032532 0.255502 0.255028 0.173367 0.171786 0.149450
polarizability: 3.34011852e+02 -1.92780723e+00 2.29436650e+02 4.54700270e+00 1.36347450e+00 1.20060941e+02
1716.lowfreq: -13.0578 -3.3210 -3.0126 -0.0005 0.0004 0.0006 10.6107 20.9753 50.9624
frequency: 6.3016 20.7912 50.9568 58.8423 60.6609 71.8169 80.9872 93.0195 107.9330 116.9444 125.7206 140.2843 153.4629 165.4656 176.5870 191.0007 195.8952 209.9724 223.5539 231.1121 252.8788 270.2276 277.0448 289.5738 308.8464 325.3825 338.8131 341.5816 360.6812 379.3168 397.1616 422.1654 443.8813 483.4679 486.3438 506.7760 517.3654 534.8818 558.4422 592.4697 614.6185 636.4385 661.6652 672.6601 711.8990 728.9523 748.1777 761.6437 818.5887 820.7344 859.6292 872.1575 911.4708 915.6696 917.5262 940.1836 945.0017 953.5018 1012.0509 1022.7992 1065.2109 1069.6512 1080.3953 1109.5542 1110.7724 1111.9896 1127.0401 1133.6239 1143.4880 1150.5670 1154.1706 1159.7309 1169.9453 1180.1485 1183.5385 1221.3456 1292.9753 1305.6632 1334.3450 1343.2112 1368.5145 1378.4892 1384.8950 1397.9530 1408.5385 1422.4878 1433.0504 1438.9362 1449.0319 1455.9670 1456.8586 1457.3337 1465.0910 1466.7944 1469.8544 1471.0125 1480.4227 1485.4598 1486.3591 1487.9882 1528.2400 1557.4272 1592.3077 1607.5996 1615.0001 1655.5279 2632.7509 2870.2652 2955.3724 2969.7054 2973.5035 2974.1849 2979.3193 3042.6310 3070.5664 3075.2839 3075.6856 3076.6100 3082.1990 3087.2810 3115.9151 3121.0971 3121.6159 3135.6640 3206.4831 3545.5347 3563.7363 3578.0029 3718.2128
redmass: 3.4501 4.5371 4.2684 3.4980 3.1452 3.3245 2.4196 2.8541 3.6005 3.7718 3.9706 1.4086 3.1764 1.2371 2.7359 2.4605 1.0476 2.9951 2.6080 1.4716 2.7921 2.5927 1.7979 4.5307 3.3636 2.5797 1.8532 1.8046 1.7694 3.9614 2.7844 4.3298 3.0991 4.6003 2.7349 4.6038 1.5198 3.1487 1.3270 4.4241 4.0162 3.3170 4.3948 9.4933 8.6283 4.5878 4.4519 3.0304 3.1341 2.2913 3.9208 7.1125 2.0877 1.4091 1.6355 1.4998 4.6794 5.8031 3.5131 1.0768 5.6909 1.9575 2.7630 1.2428 1.2550 1.2424 1.9745 2.1443 2.0844 1.7092 1.3874 1.4816 2.2822 2.0997 1.8173 1.5635 1.3635 2.9067 1.5426 3.3931 1.2547 3.6856 1.4931 2.5172 2.1105 1.2765 1.3741 1.2270 1.7967 1.1058 1.0708 1.1596 1.0511 1.0499 1.3351 1.0718 1.0541 1.3331 1.0636 1.3941 3.8932 2.7489 3.1185 1.6599 5.2589 2.4458 1.0846 1.0820 1.0331 1.0340 1.0310 1.0347 1.0352 1.1037 1.1001 1.1020 1.1001 1.0985 1.0995 1.0998 1.1033 1.1045 1.0990 1.0902 1.0922 1.0755 1.0445 1.0814 1.1044
irintensity: 0.0900 0.5837 0.2694 0.1580 1.8698 7.9256 10.9021 3.0636 2.0320 5.8851 6.3172 1.0317 0.9917 1.4310 7.8396 12.9396 0.3205 3.4460 9.7813 2.7631 1.4017 2.2724 0.4059 7.8390 7.1545 9.3353 75.5929 21.0207 141.9088 4.2346 1.6014 12.9645 12.6418 10.9310 18.2684 6.7466 13.9384 10.0869 170.7584 22.8747 14.2331 3.2699 8.8319 0.2265 7.9216 5.2350 8.2349 22.2919 5.3405 27.9614 3.2607 7.0634 2.3105 17.8860 29.0003 2.7201 14.8634 66.6896 58.2208 100.1910 173.9087 19.9419 68.8184 8.7712 2.2677 3.5004 0.1782 24.7884 14.6365 28.7021 4.1024 40.8026 27.6371 84.0487 89.4617 149.8398 58.6579 8.1681 168.6652 41.9637 40.3486 148.7816 85.4525 271.5273 58.3031 10.9417 137.4223 9.8106 115.2204 58.9068 14.9684 56.2952 12.8596 2.6234 174.5434 24.1315 15.3555 47.4308 6.0465 148.1855 225.3990 525.3867 625.9495 390.0616 109.3700 496.3074 835.8449 64.4425 66.7309 98.7569 75.3658 37.2586 40.2510 48.9835 29.9648 35.0007 25.8768 35.1018 69.9985 43.0761 27.1921 19.5142 24.1009 12.2603 33.8950 11.6883 36.8042 14.8662 28.0436
temp: 298.150 k
press: 1.00000 atm
elementType: 8 8 8 7 7 7 7 7 6 6 6 6 6 6 6 6 6 6 6 6 6 6 1 1 1 1 1 1 1 1 1 1 1 1 1 1 1 1 1 1 1 1 1 1 1
symmnumber: 1
zpe: 962599.7 jmol-1
zpe.correction: 0.366635 hartree
zpe.thermalcorrener: 0.391887 hartree
zpe.thermalcorrenthalpy: 0.392831 hartree
zpe.thermalcorrgfe: 0.309642 hartree
zpe.sumelectzpe: -1044.983708 hartree
zpe.sumelectthermal: -1044.958456 hartree
zpe.sumelectthermalent: -1044.957512 hartree
zpe.sumelectthermalfe: -1045.040701 hartree
dipole: -0.1089 -3.1720 0.0738
dipole: 3.1747
quadrupole: -118.4918 -103.0148 -135.5786
quadrupole: -12.7817 4.2583 -1.8965
quadrupole: 0.5366 16.0136 -16.5502 -12.7817 4.2583 -1.8965
hfenergy: -1045.3503425 hartree
pointgroup: C01 [X(C14H23N5O3)]
dipole: 0.0127229 1.2289253 0.2227714 debye
polarizability: 334.138942|0.5037912|227.2144004|0.4979164|15.3930521|122.1561015 unknown
InChI: InChI=1S/C14H23N5O3/c1-8(2)17-13(15)19-14(16)18-9-6-10(20-3)12(22-5)11(7-9)21-4/h6-8,18H,15-16H2,1-5H3
charge 0 multiplicity 1
45 atoms
O  -4.53401 -1.261302 -0.280294
O  -2.042873 -2.682457 -0.426522
O  -4.497746 1.485886 0.147255
N  0.40706 1.508796 0.18397
N  4.434384 0.236132 0.094893
N  2.058667 -0.198256 0.030066
N  2.690903 2.089685 0.276825
N  3.505294 -1.98732 -0.127792
C  -0.796916 0.763883 0.065389
C  -3.308862 -0.572025 -0.146432
C  -2.084971 -1.282472 -0.267771
C  -3.250612 0.838864 0.057008
C  -0.83767 -0.628435 -0.163587
C  -2.010834 1.501895 0.170289
C  5.826739 -0.266447 0.071636
C  6.751974 0.875666 -0.396389
C  6.253973 -0.787266 1.470912
C  1.745818 1.097523 0.159457
C  3.399426 -0.605131 0.006447
C  -5.375545 -1.288891 0.935831
C  -2.765035 -3.235383 -1.593146
C  -4.494791 2.939698 0.308679
H  0.092217 -1.189191 -0.246039
H  -1.975134 2.58423 0.336171
H  5.935946 -1.102821 -0.662291
H  0.273005 2.513357 0.308482
H  7.804966 0.541014 -0.44022
H  6.451427 1.231829 -1.397389
H  6.684121 1.727274 0.305697
H  7.290086 -1.174539 1.449318
H  5.586011 -1.592464 1.827891
H  6.205283 0.038103 2.204042
H  -4.824015 -1.752168 1.776103
H  -6.247733 -1.906932 0.671347
H  -5.697974 -0.268034 1.204287
H  -2.31437 -2.857481 -2.531814
H  -3.835022 -2.97295 -1.553085
H  -2.626388 -4.325613 -1.525347
H  -5.556114 3.22847 0.328682
H  -3.990176 3.436796 -0.542753
H  -4.008774 3.242096 1.257456
H  2.454983 3.077263 0.362695
H  3.686952 1.67074 0.242025
H  2.641652 -2.51708 -0.211454
H  4.401776 -2.460642 -0.16583
