program: Gaussian 09
title: 000289373
version: EM64L-G09RevD.01
frameworkgroup: C1[X(C19H16N2O8)]
method: RPBEPBE
basis: SDD
operation: Freq
keyword: #p
keyword: freq=noraman
keyword: PBEPBE/SDD
title: #p freq=noraman PBEPBE/SDD
converged: YES YES NO NO
title: Mulliken charges:
elementType: O O O O O O O O N N C C C C C C C C C C C C C C C C C C C H H H H H H H H H H H H H H H H
charge: -0.275376 -0.252127 -0.192538 -0.276184 -0.302847 -0.245474 -0.199467 -0.199905 -0.457055 0.027825 0.371012 0.023561 -0.696926 -0.449460 0.300219 0.201957 0.314916 0.144337 -0.303715 -0.384684 -0.315004 -0.332946 0.220522 0.387051 -0.383618 -0.364753 0.160116 -0.495557 -0.498410 0.271402 0.268107 0.347448 0.395324 0.279869 0.278973 0.301312 0.286444 0.290684 0.290926 0.246631 0.251018 0.239155 0.239067 0.244395 0.243775
chargesum: 0.00000
title: Mulliken charges with hydrogens summed into heavy atoms:
elementType: O O O O O O O O N N C C C C C C C C C C C C C C C C C C C
charge: -0.275376 -0.252127 -0.192538 -0.276184 -0.302847 -0.245474 -0.199467 -0.199905 -0.061731 0.027825 0.371012 0.023561 -0.157417 -0.102012 0.300219 0.201957 0.314916 0.144337 -0.023846 -0.105711 -0.013692 -0.046502 0.220522 0.387051 -0.092934 -0.073827 0.160116 0.241247 0.228827
polarizability: 3.53076827e+02 -3.31142657e+01 3.21223980e+02 -8.39677364e+00 1.71736039e+01 1.56137817e+02
1716.lowfreq: -2.7795 -0.0008 -0.0007 -0.0004 1.0260 4.6102 11.0999 15.7377 30.4150
frequency: 10.9694 15.6049 30.4142 34.8451 43.0246 54.1609 67.3692 69.5745 76.6482 78.5909 93.5885 95.5063 100.1700 115.4759 129.1439 138.0861 155.9431 167.6519 187.7925 222.6030 239.3164 262.9148 268.7947 274.5811 288.2330 290.9731 308.0516 327.8324 356.6750 408.3601 420.7447 433.0936 443.9787 450.1776 484.2651 492.2460 513.3774 525.0331 543.8939 557.6803 575.5398 616.5498 624.0088 656.7623 668.7518 677.5899 679.8819 715.0676 730.9656 740.5844 751.3734 776.4071 780.7698 795.8376 814.7335 862.4061 874.6271 885.6074 889.1725 913.8450 923.7886 935.1752 949.5774 966.7948 976.6025 997.9762 1003.2907 1006.3161 1012.0263 1025.6361 1062.1217 1081.2220 1089.9952 1111.2434 1114.5437 1114.7101 1121.5715 1144.2286 1151.5089 1153.3708 1188.3264 1198.1757 1215.7772 1231.2193 1243.3634 1257.8371 1273.0038 1280.3475 1303.9808 1309.5295 1366.9921 1386.4835 1403.5821 1411.7703 1413.5002 1424.7091 1429.0256 1452.5125 1452.8790 1456.8524 1461.2535 1461.8328 1467.5738 1481.4845 1515.8271 1570.8256 1578.8216 1583.8633 1600.3046 1608.4199 1613.9149 1627.7695 1646.8171 3005.8456 3010.7472 3039.9279 3108.0322 3113.3981 3115.5117 3147.5397 3153.7716 3157.3875 3162.0291 3166.0486 3185.0750 3187.6255 3187.9132 3203.9370 3205.7760
redmass: 8.2558 7.1738 7.5530 4.8584 9.7658 5.4451 3.8277 5.6327 5.9711 8.8703 5.3337 1.1676 1.2807 4.1284 6.5402 4.1226 6.2133 4.3669 5.4089 7.2667 6.1051 6.4916 6.1602 7.2272 9.0347 5.1659 5.7759 5.7024 6.0452 2.8949 4.7804 5.1776 5.1224 3.5590 5.7295 5.5606 6.3879 6.3120 6.0367 5.3109 4.7290 6.4266 7.0733 5.8219 4.5804 6.3858 6.6471 6.3113 4.5664 4.7715 6.0464 6.3292 4.7002 7.8095 4.8692 1.2491 1.4983 1.9116 5.2816 7.6760 1.7373 2.1374 2.7663 4.3745 1.4091 1.8351 1.3579 2.0222 1.4369 2.7159 5.4085 3.1998 3.1967 1.4249 1.2639 1.2610 1.4727 1.4834 1.4717 1.5537 1.3967 2.4238 3.8349 3.2531 2.5694 1.5195 2.1709 2.3028 1.8195 1.6321 7.5664 7.9128 11.3617 2.9902 3.6348 1.2532 1.3855 1.0497 1.0497 1.3273 1.0675 1.0531 2.1551 2.0481 3.4543 9.8362 5.7091 5.7933 7.4828 6.5547 8.1985 7.1287 2.5531 1.0297 1.0294 1.0586 1.1046 1.1049 1.1049 1.0927 1.1047 1.1053 1.0900 1.0892 1.0944 1.0963 1.0961 1.0927 1.0832
irintensity: 0.1696 0.0895 0.3562 2.6777 1.1376 0.1623 0.0935 0.1699 3.0283 4.4643 2.5530 0.3087 0.2971 0.2445 2.7482 0.0860 12.9107 14.5212 7.1051 0.1700 0.1459 3.1279 5.0435 6.2078 2.7191 29.9455 0.8191 2.8206 17.0784 0.9140 4.1213 4.3535 6.8820 1.3902 16.9256 14.4978 5.4746 5.1453 5.6610 7.0947 6.9439 2.5522 0.6087 12.6171 22.2730 11.8607 1.2999 22.8711 38.6927 10.1968 17.3722 2.8675 0.0666 18.5746 4.7468 3.4888 24.7373 72.0549 5.7365 10.8430 46.8248 30.4433 80.1866 47.0658 30.3251 3.2005 0.0050 19.4306 2.7857 43.4194 87.3553 221.2408 26.2546 27.2630 0.0136 0.1793 84.5714 7.7160 3.6784 146.9340 21.1055 233.2305 537.7200 92.7206 727.1616 77.1853 125.7718 44.0089 39.1229 14.5808 82.2550 82.4297 5.9869 54.8525 80.8055 7.1520 87.4658 15.3957 15.0871 70.1663 16.1431 5.8322 22.0911 7.2486 420.1564 218.0050 523.2820 33.4329 39.9595 64.2561 79.5679 38.9933 18.7940 35.4802 34.4519 3.3403 23.9270 7.4208 20.5986 16.9211 11.2343 16.4765 2.6366 0.5351 1.2800 0.6738 0.3207 6.8025 278.6300
temp: 298.150 k
press: 1.00000 atm
elementType: 8 8 8 8 8 8 8 8 7 7 6 6 6 6 6 6 6 6 6 6 6 6 6 6 6 6 6 6 6 1 1 1 1 1 1 1 1 1 1 1 1 1 1 1 1
symmnumber: 1
zpe: 854245.6 jmol-1
zpe.correction: 0.325365 hartree
zpe.thermalcorrener: 0.352670 hartree
zpe.thermalcorrenthalpy: 0.353615 hartree
zpe.thermalcorrgfe: 0.262827 hartree
zpe.sumelectzpe: -1442.793412 hartree
zpe.sumelectthermal: -1442.766106 hartree
zpe.sumelectthermalent: -1442.765162 hartree
zpe.sumelectthermalfe: -1442.855950 hartree
dipole: 5.1184 -3.0918 1.5640
dipole: 6.1809
quadrupole: -195.9798 -153.3674 -163.8620
quadrupole: -7.3411 -8.7934 4.3940
quadrupole: -24.9101 17.7023 7.2077 -7.3411 -8.7934 4.3940
hfenergy: -1443.1187768 hartree
pointgroup: C01 [X(C19H16N2O8)]
dipole: 1.5810971 -1.7120133 0.6946854 debye
polarizability: 332.27592|-36.5204019|343.3724924|-1.5323223|10.1723749|154.7902112 unknown
InChI: InChI=1S/C19H16N2O8/c1-28-18(24)12-5-8-14(19(25)29-2)15(9-12)20-17(23)10-16(22)11-3-6-13(7-4-11)21(26)27/h3-9,20H,10H2,1-2H3
charge 0 multiplicity 1
45 atoms
O  3.724279 -4.113591 -0.537794
O  0.02735 0.882547 1.490934
O  -2.299893 -2.44895 0.017546
O  3.368458 3.208415 0.056047
O  1.658021 -3.712545 0.430249
O  5.430505 2.682399 -0.890463
O  -5.858664 3.999468 -0.286602
O  -6.948242 2.52316 -1.641636
N  0.964266 -1.187936 0.855533
N  -6.009965 2.829883 -0.810282
C  2.219894 -0.801969 0.329166
C  3.119548 -1.829435 -0.131659
C  -1.291146 -1.164476 1.815002
C  2.616719 0.558572 0.237313
C  3.875671 0.892336 -0.305924
C  -0.034092 -0.379013 1.379219
C  -3.225563 -0.239333 0.295329
C  -2.2833 -1.355943 0.651783
C  4.379905 -1.46008 -0.673977
C  4.763493 -0.115604 -0.764786
C  -3.09485 1.068147 0.838294
C  -4.273129 -0.521145 -0.625799
C  2.748682 -3.264019 -0.043588
C  -5.041037 1.765256 -0.430941
C  -4.003223 2.080205 0.471508
C  -5.191433 0.476344 -0.991774
C  4.324511 2.316452 -0.421468
C  3.408112 -5.563193 -0.483814
C  3.732521 4.642889 -0.022211
H  -1.015171 -2.172337 2.166895
H  -1.754544 -0.603331 2.641589
H  1.944015 1.340308 0.591012
H  0.806679 -2.216945 0.830688
H  5.045674 -2.254344 -1.01951
H  5.731417 0.178545 -1.180312
H  -2.263853 1.307584 1.509777
H  -4.343846 -1.532405 -1.038243
H  -3.921604 3.096361 0.865194
H  -6.009884 0.284566 -1.690126
H  3.276134 -5.883053 0.562969
H  2.484176 -5.77113 -1.04786
H  4.277318 -6.052378 -0.943813
H  2.863319 5.173865 0.389173
H  3.918576 4.931592 -1.070266
H  4.639592 4.837959 0.574126
