program: Gaussian 09
title: 000289335
version: EM64L-G09RevD.01
frameworkgroup: C1[X(C16H16Cl3N3)]
method: RPBEPBE
basis: SDD
operation: Freq
keyword: #p
keyword: freq=noraman
keyword: PBEPBE/SDD
title: #p freq=noraman PBEPBE/SDD
converged: YES YES NO NO
title: Mulliken charges:
elementType: Cl Cl Cl N N N C C C C C C C C C C C C C C C C H H H H H H H H H H H H H H H H
charge: -0.051537 -0.024335 -0.061956 -0.156654 -0.107599 -0.106866 -0.394264 -0.397763 0.459616 -0.345602 -0.321988 -0.583209 -0.655948 -0.373853 -0.316148 0.146108 0.303419 -0.295667 -0.245626 -0.080598 -0.193622 -0.236669 0.254489 0.252771 0.231420 0.226439 0.234900 0.234291 0.267208 0.292740 0.221893 0.242598 0.223116 0.250421 0.284935 0.302096 0.260039 0.261405
chargesum: 0.00000
title: Mulliken charges with hydrogens summed into heavy atoms:
elementType: Cl Cl Cl N N N C C C C C C C C C C C C C C C C
charge: -0.051537 -0.024335 -0.061956 -0.156654 -0.107599 -0.106866 0.112996 0.060095 0.459616 -0.110702 -0.087697 -0.023261 0.031659 -0.123432 -0.031213 0.146108 0.303419 -0.295667 0.056470 -0.080598 0.066417 0.024735
polarizability: 5.79720425e+02 -2.24309756e+01 2.53970354e+02 8.88296982e+00 1.40302454e+01 1.06300551e+02
1716.lowfreq: -5.5185 -2.3037 -0.0015 -0.0005 0.0002 4.2860 8.7380 25.5776 31.1412
frequency: 8.5206 25.5733 31.1384 43.1213 57.3739 73.7209 89.1633 93.5407 109.4241 121.8591 140.1606 160.3174 187.8042 211.7283 225.6911 226.6227 242.5193 277.6696 282.4997 308.7784 310.1585 353.3017 379.5271 404.1458 428.8901 435.2603 458.0836 469.3634 513.8308 526.6088 543.0446 572.6735 579.5184 614.0156 633.2002 672.8383 700.0154 716.8479 739.6832 745.5425 784.3475 792.5921 804.4603 807.0981 834.7783 847.6975 894.9673 909.6457 914.4094 940.4654 963.3818 987.8695 988.1581 990.8432 1016.4508 1020.5588 1038.1844 1064.3144 1078.6506 1104.0348 1122.6398 1128.4725 1157.3334 1172.1941 1183.5570 1208.4007 1227.5215 1255.6366 1263.4520 1271.2997 1287.9242 1309.2637 1331.3032 1342.5454 1352.3158 1356.6535 1375.4858 1386.3557 1391.9562 1399.4212 1438.8872 1456.3779 1461.1046 1468.4682 1480.6630 1491.8208 1502.0315 1514.6641 1549.5917 1551.4463 1583.5226 1621.7280 2988.8291 3002.2211 3022.5736 3051.4796 3062.4284 3078.6974 3085.7070 3097.2198 3146.3146 3147.9980 3148.7066 3163.3996 3168.8614 3169.1825 3174.9337 3183.2007
redmass: 11.4981 9.8893 5.7808 7.0599 4.7542 4.3705 9.4757 3.1159 3.6810 5.4898 4.1341 6.5065 5.1317 1.4366 4.8351 6.8660 3.5264 5.2611 3.1915 26.3892 6.1413 4.6772 4.4357 3.9213 3.7592 3.4629 3.4076 5.9417 3.0147 3.6855 3.6313 7.0174 4.2502 6.1013 7.1901 6.2395 5.4256 4.1294 5.1680 4.2418 1.1364 1.1782 1.3484 1.2759 1.6793 6.8046 2.3383 7.3565 1.4401 1.3424 1.3638 2.6869 1.4440 2.3580 1.5180 6.8235 3.9520 1.7556 2.0298 1.6019 1.8018 1.5017 1.6708 1.7657 1.6682 2.1132 1.4783 1.1703 2.4734 1.3677 1.1807 1.4625 4.3459 1.3077 1.4169 4.1127 4.7645 4.6636 1.2751 2.1807 2.5361 1.8098 1.5776 1.0518 1.0758 1.1104 1.6622 1.5828 6.5220 6.8506 8.6365 6.4112 1.0357 1.0610 1.0604 1.1025 1.0569 1.1040 1.0999 1.1010 1.1068 1.0897 1.0904 1.0888 1.0944 1.0927 1.0955 1.0977
irintensity: 0.0856 0.2093 0.7133 1.2069 1.1470 0.7877 0.3969 0.0675 0.9899 0.5218 0.0599 0.0401 0.3308 4.0142 5.3324 0.2152 5.8239 2.4254 0.5605 0.4925 0.1484 6.4320 1.1063 11.0182 3.0650 7.5507 10.4521 28.1660 19.5666 19.8050 6.1819 27.0619 0.4130 6.4675 5.6169 82.9662 26.3853 0.5770 17.7161 6.9265 10.5421 16.2484 47.7108 2.2565 64.4994 51.3996 3.1755 45.3158 19.6533 2.1298 3.5631 0.2577 10.3220 52.3541 5.5805 81.1572 0.1658 30.3332 32.0983 29.1498 7.8427 16.7206 192.8297 27.8150 125.7336 52.5908 9.6839 34.5389 22.3130 123.9958 6.1076 66.0239 608.9291 10.4251 28.9445 1.5768 4.2908 3.5732 24.8087 159.0649 104.7769 7.3463 9.9085 10.0980 0.5236 31.6054 71.5538 96.4174 4.7022 107.9238 21.1586 659.4232 29.5772 52.3300 36.3176 5.8032 16.7588 5.7427 41.4023 43.4066 18.5015 8.7810 3.9631 2.1419 14.3358 5.1139 27.4097 3.4544
temp: 298.150 k
press: 1.00000 atm
elementType: 17 17 17 7 7 7 6 6 6 6 6 6 6 6 6 6 6 6 6 6 6 6 1 1 1 1 1 1 1 1 1 1 1 1 1 1 1 1
symmnumber: 1
zpe: 752645.3 jmol-1
zpe.correction: 0.286667 hartree
zpe.thermalcorrener: 0.308375 hartree
zpe.thermalcorrenthalpy: 0.309319 hartree
zpe.thermalcorrgfe: 0.231687 hartree
zpe.sumelectzpe: -2162.100400 hartree
zpe.sumelectthermal: -2162.078693 hartree
zpe.sumelectthermalent: -2162.077749 hartree
zpe.sumelectthermalfe: -2162.155381 hartree
dipole: 5.1842 -2.7982 -0.0427
dipole: 5.8913
quadrupole: -134.6933 -149.4561 -153.1872
quadrupole: -27.7616 -0.5752 1.0004
quadrupole: 11.0855 -3.6772 -7.4084 -27.7616 -0.5752 1.0004
hfenergy: -2162.3870675 hartree
pointgroup: C01 [X(C16H16Cl3N3)]
dipole: 2.0691549 1.0443802 0.0129417 debye
polarizability: 580.4075833|13.9461098|252.2940562|-14.3317932|17.2945978|107.2896906 unknown
InChI: InChI=1S/C16H16Cl3N3/c1-2-22(10-9-17)14-6-4-13(5-7-14)20-21-16-11-12(18)3-8-15(16)19/h3-8,11H,2,9-10H2,1H3
charge 0 multiplicity 1
38 atoms
Cl 6.482663 -2.877091 0.333425
Cl -3.28255 -3.293051 -0.49762
Cl -6.404169 2.220648 0.602325
N  4.328337 0.642626 -0.10577
N  -1.348591 0.552915 0.090403
N  -1.960206 -0.600679 -0.07655
C  5.132767 -0.546168 -0.443404
C  5.074334 1.903741 0.115286
C  2.930703 0.596913 -0.066521
C  2.151689 1.781782 0.150965
C  2.221578 -0.644229 -0.238078
C  5.425389 -1.386978 0.81407
C  5.210505 2.765522 -1.16077
C  0.753636 1.720371 0.198878
C  0.827082 -0.695557 -0.196499
C  0.061817 0.489862 0.025921
C  -3.381921 -0.521087 -0.005668
C  -4.130222 -1.718177 -0.184708
C  -4.100109 0.688893 0.236337
C  -5.495836 0.664967 0.290483
C  -5.537568 -1.724806 -0.127433
C  -6.238827 -0.523234 0.112961
H  4.626011 -1.165403 -1.203432
H  6.087945 -0.217769 -0.889599
H  4.589274 2.479818 0.923611
H  6.080183 1.636682 0.488827
H  2.637172 2.753339 0.271293
H  2.770846 -1.576744 -0.397352
H  6.010797 -0.829821 1.560564
H  4.512637 -1.797041 1.269532
H  5.74316 2.211789 -1.954694
H  4.221504 3.055369 -1.555175
H  5.781909 3.686365 -0.943179
H  0.160707 2.626283 0.363524
H  0.294254 -1.642685 -0.326558
H  -3.520018 1.605913 0.373132
H  -6.084075 -2.661275 -0.269283
H  -7.330906 -0.514608 0.160356
