program: Gaussian 09
title: 000289314
version: EM64L-G09RevD.01
frameworkgroup: C1[X(C8H7FN2O5S)]
method: RPBEPBE
basis: SDD
operation: Freq
keyword: #p
keyword: freq=noraman
keyword: PBEPBE/SDD
title: #p freq=noraman PBEPBE/SDD
converged: NO YES NO NO
title: Mulliken charges:
elementType: S F O O O O O N N C C C C C C C C H H H H H H H
charge: 1.097056 -0.337810 -0.466113 -0.465958 -0.165120 -0.241915 -0.230812 -0.438512 0.033647 0.372972 -0.124973 0.226773 -0.326866 -0.284001 -0.212171 0.232750 -0.780725 0.338349 0.337099 0.293746 0.367246 0.251261 0.272617 0.251460
chargesum: 0.00000
title: Mulliken charges with hydrogens summed into heavy atoms:
elementType: S F O O O O O N N C C C C C C C C
charge: 1.097056 -0.337810 -0.466113 -0.465958 -0.165120 -0.241915 -0.230812 -0.071266 0.033647 0.372972 -0.124973 0.226773 0.011484 0.053097 0.081575 0.232750 -0.005386
polarizability: 2.38032131e+02 -5.09632183e+00 1.72883616e+02 4.93184558e+00 1.57218318e+00 7.37412577e+01
1716.lowfreq: -32.5955 -2.6715 -0.0009 -0.0006 0.0006 1.2243 7.8408 25.1319 48.9966
frequency: -32.4162 25.1154 48.9943 55.8923 86.6444 95.2297 115.2698 147.2281 153.9542 188.4255 207.2777 213.6485 259.9052 296.2842 300.3374 340.8730 365.0460 381.9208 411.2027 434.5533 438.0478 514.7977 528.1124 561.3533 587.1915 596.5497 654.1864 676.0530 686.4646 742.8082 796.8416 826.7343 858.7889 864.1275 903.3806 926.9593 936.3965 986.5194 1000.4150 1010.6742 1038.9525 1059.2433 1067.8425 1148.5358 1161.7294 1219.0649 1236.0138 1302.2580 1338.9379 1359.4939 1384.9355 1421.2841 1446.6057 1463.3240 1473.0535 1516.3992 1575.0049 1605.4239 1644.8546 2995.4921 3079.9252 3143.4854 3163.4930 3165.5693 3187.6621 3270.4839
redmass: 1.0514 15.5432 5.2156 12.2878 5.3982 9.5105 8.8897 6.7905 5.5480 8.3319 12.4251 8.2746 12.6170 10.6553 10.9473 6.2556 6.9007 8.2341 8.2317 4.1738 8.5392 5.7916 5.1777 7.4447 3.0279 6.4869 6.8619 8.2276 8.4351 4.8221 8.0798 5.7299 14.9291 1.4118 1.1210 5.6283 1.3702 1.7777 16.3749 1.3254 1.6897 6.2427 1.9727 1.5832 4.8107 3.5406 1.5067 2.0410 5.4736 4.5545 1.2331 5.7937 1.1339 1.0454 3.1117 2.4616 4.5207 6.2060 4.7545 1.0385 1.0978 1.0988 1.0914 1.0925 1.0963 1.0796
irintensity: 1.3032 0.0809 0.1617 3.7712 8.6430 1.6806 0.7075 8.4433 0.5465 7.9537 3.3924 1.5105 3.1759 3.0924 2.9647 18.0311 0.7761 15.5132 10.7373 1.7069 58.6207 23.5524 31.8252 123.5269 2.7962 56.2547 10.6927 1.1728 2.2373 0.9255 11.9221 9.8792 108.0467 42.3662 81.4140 1.3689 13.9110 49.4041 61.0875 5.6127 13.3144 10.1052 82.1843 99.0113 178.1160 203.6287 33.7393 30.7618 479.8939 61.7967 74.9609 17.0042 19.7703 21.4348 199.0627 203.1031 280.4012 97.6638 89.2222 1.7030 7.0096 6.5916 7.9929 24.9820 21.4413 128.3223
temp: 298.150 k
press: 1.00000 atm
elementType: 16 9 8 8 8 8 8 7 7 6 6 6 6 6 6 6 6 1 1 1 1 1 1 1
symmnumber: 1
zpe: 398914.4 jmol-1
zpe.correction: 0.151938 hartree
zpe.thermalcorrener: 0.167862 hartree
zpe.thermalcorrenthalpy: 0.168806 hartree
zpe.thermalcorrgfe: 0.106862 hartree
zpe.sumelectzpe: -1291.093364 hartree
zpe.sumelectthermal: -1291.077440 hartree
zpe.sumelectthermalent: -1291.076496 hartree
zpe.sumelectthermalfe: -1291.138440 hartree
dipole: 6.7170 -0.8636 -0.5436
dipole: 6.7940
quadrupole: -112.9362 -123.0871 -107.5885
quadrupole: -0.0303 1.5075 0.0587
quadrupole: 1.6011 -8.5498 6.9487 -0.0303 1.5075 0.0587
hfenergy: -1291.2453022 hartree
pointgroup: C01 [X(C8H7F1N2O5S1)]
dipole: -2.6485225 0.2939485 -0.2091342 debye
dipolederiv: 2.3483967 0.1539539 0.0102855 0.0879182 1.1328564 0.021095 0.0977144 0.0272522 1.601648 -0.6029056 -0.0410109 -0.0465533 -0.0549185 -0.3146554 -0.0547914 -0.3518641 -0.0739863 -0.8720872 -0.7229875 -0.0001188 0.0196659 0.1285543 -0.4917719 -0.057431 0.0551425 -0.0180316 -0.4103252 -0.7021623 -0.0549473 0.0121643 -0.1375438 -0.5095806 0.0840093 0.0582733 0.0433154 -0.4327668 -0.4873518 0.251268 0.0103534 0.1536317 -0.8965764 -0.0109694 0.0090502 -0.0134722 -0.1939051 -0.8311197 -0.2050113 0.0142798 -0.1019182 -0.5143787 -0.0001502 0.0142713 0.0032109 -0.2474117 -0.6669448 -0.0882709 0.0080713 0.5004386 -0.9966869 -0.0119343 0.0077489 0.0009464 -0.314938 -2.2404521 0.7631767 0.0478154 0.7069265 -0.7852583 -0.0193326 0.036859 -0.0196281 -0.2855671 1.0337944 0.2454176 -0.0237464 0.1536635 1.8244713 0.0118687 -0.0128643 0.0071311 0.2066764 1.5802704 -0.5003102 -0.0362959 0.3687701 0.1698795 -0.0096043 -0.0343503 0.014095 0.1527675 -0.3242226 -0.048679 0.0056489 0.0359013 -0.5155214 0.0022036 0.2209793 0.0344461 -0.1682959 -0.4168016 -0.333602 0.0090174 0.0528674 -0.7939609 -0.0067885 0.0093939 -0.0014514 0.0114788 0.0675651 0.3836218 -0.0036862 0.2633467 0.1289022 -0.0066822 -0.0536671 -0.0137922 -0.0210099 -0.6749437 0.0334565 0.0098094 -0.3511038 0.042508 0.0091277 0.0036373 0.0014275 -0.1306757 0.2663745 -0.1428452 -0.0130276 -0.3559609 0.2325164 0.0129977 -0.0529553 -0.0097925 -0.042191 1.9749725 -0.3900996 -0.0446127 -1.1485987 1.4955005 0.0282524 -0.0471858 0.0108928 0.1960513 -0.5094546 -0.055224 0.0136264 -0.2258103 -0.0576173 0.0057099 0.0175526 0.0016302 0.0289644 0.1778695 0.0055283 0.0037122 0.0319044 0.1562064 -0.0012434 0.0037432 -0.0038207 0.166545 0.1773368 0.0253996 0.0008353 -0.0598002 0.114035 0.0017929 0.013917 0.0010073 0.1813219 0.1211662 -0.0522501 0.003602 -0.0184519 0.0943621 0.0000487 0.0056428 0.0092635 0.1514544 0.2413763 -0.0043906 0.0012342 -0.1248246 0.3706447 0.0044628 0.0011895 0.0008091 0.2982287 0.0812729 0.0018 0.0168881 -0.0120879 0.0582131 -0.0977493 -0.0172491 -0.0921578 -0.0071553 0.029797 0.0459408 0.0030719 0.1133316 -0.0005211 -0.0036648 0.0038054 -0.0017455 0.136127 0.0791541 0.0071968 -0.0221592 -0.0062354 0.0564333 0.0987725 0.0112156 0.0924509 -0.0049345 unknown
polarizability: 238.2003473|-3.7940931|172.7441004|-4.9541292|0.0050957|73.712557 unknown
InChI: InChI=1S/C8H7FN2O5S/c1-5(12)10-7-3-2-6(17(9,15)16)4-8(7)11(13)14/h2-4,10H,1H3
charge 0 multiplicity 1
24 atoms
S  3.555365 0.429888 -0.132543
F  3.825514 0.617294 1.696018
O  4.174766 -0.992568 -0.543152
O  4.031212 1.816542 -0.785985
O  -0.110444 -3.339003 -0.074579
O  -2.201459 -2.454335 -0.004107
O  -3.128633 2.430789 0.033259
N  -2.511958 0.153583 0.014485
N  -0.898419 -2.326802 -0.041241
C  -1.119998 0.230401 -0.018837
C  1.694803 0.343513 -0.083857
C  -0.316127 -0.969491 -0.045295
C  1.095438 -0.912449 -0.070246
C  -0.43261 1.487645 -0.035003
C  0.964751 1.550339 -0.063093
C  -3.452996 1.213222 0.039246
C  -4.893373 0.72694 0.077897
H  1.67379 -1.841706 -0.0878
H  -1.033377 2.398716 -0.019746
H  1.479306 2.516277 -0.080748
H  -2.868882 -0.820583 0.022637
H  -5.129858 0.114229 -0.811256
H  -5.562368 1.598359 0.100718
H  -5.079441 0.106098 0.973332
