program: Gaussian 09
title: 000289299
version: EM64L-G09RevD.01
frameworkgroup: C1[X(C7H12O3)]
method: RPBEPBE
basis: SDD
operation: Freq
keyword: #pfreq=noraman
keyword: PBEPBE/SDD
title: #p freq=noraman PBEPBE/SDD
converged: YES YES NO NO
title: Mulliken charges:
elementType: O O O C C C C C C C H H H H H H H H H H H H
charge: -0.262154 -0.249172 -0.183151 -0.244580 -0.391186 0.222849 -0.684541 -0.100520 -0.263004 -0.662526 0.283558 0.243384 0.226617 0.239374 0.228342 0.219333 0.217614 0.227339 0.237582 0.221159 0.245414 0.228268
chargesum: 0.00000
title: Mulliken charges with hydrogens summed into heavy atoms:
elementType: O O O C C C C C C C
charge: -0.262154 -0.249172 -0.183151 0.038978 0.078815 0.222849 0.002508 0.117093 0.201917 0.032316
polarizability: 1.05087750e+02 -2.18278862e+00 7.30361090e+01 2.74432840e-01 -1.52184044e-01 7.42544821e+01
1716.lowfreq: -12.6730 -8.2401 -5.8413 -0.0009 -0.0008 -0.0005 26.2930 47.2007 73.9031
frequency: 25.9919 47.1304 73.8900 87.1406 97.5542 155.6695 189.5229 217.8664 223.0786 270.3032 303.5508 320.0399 411.4987 440.8691 508.9943 671.5147 707.3671 764.8873 799.7434 812.2424 832.0884 911.5679 961.0184 984.3827 1015.2475 1068.3767 1079.4966 1094.6219 1115.8884 1130.8094 1156.9506 1218.0569 1256.6630 1278.4461 1308.5165 1341.8988 1357.5238 1380.6439 1392.6366 1402.4426 1457.4657 1463.5614 1465.6406 1477.2609 1482.5338 1484.6395 1622.6702 1644.9541 2925.3331 2988.4300 2992.8957 2997.8334 3031.9408 3047.5774 3054.3493 3083.3153 3088.4281 3091.1446 3092.9054 3120.0333
redmass: 4.4309 2.9851 3.8327 4.5634 1.9526 2.6861 2.6419 1.3253 1.5024 1.9194 3.3744 3.2978 5.2383 3.5269 3.4415 4.7329 3.7269 1.4914 2.5661 1.3653 2.6578 2.4396 1.7435 2.0590 2.6228 2.2571 2.6560 2.2628 3.2255 1.7230 1.6794 1.2899 1.2130 1.1186 1.4706 1.3406 1.3037 1.3444 1.2343 1.2122 1.0948 1.0432 1.0800 1.0416 1.0547 1.0504 9.4253 7.7395 1.0880 1.0360 1.0359 1.0600 1.0595 1.0840 1.1027 1.0999 1.0976 1.1008 1.1027 1.1068
irintensity: 0.9304 0.4255 10.8525 0.2736 3.7822 1.3065 3.3985 2.4482 4.6978 6.4822 5.4681 13.6622 3.0748 2.8415 15.0979 4.7440 4.6108 10.2302 1.2661 11.6966 5.4449 9.0453 7.4145 38.3750 29.3389 14.3814 67.9587 69.8182 190.8563 79.9615 21.9387 19.1038 22.8971 4.0844 48.4458 12.3330 6.7833 9.4339 20.8662 20.7902 10.8829 16.0822 13.0369 16.3113 2.0422 15.6602 146.6710 147.9927 47.8481 22.0405 16.0891 21.2751 29.2789 4.2484 3.3868 35.0273 43.1349 28.0640 2.4125 30.2604
temp: 298.150 k
press: 1.00000 atm
elementType: 8 8 8 6 6 6 6 6 6 6 1 1 1 1 1 1 1 1 1 1 1 1
symmnumber: 1
zpe: 472698.7 jmol-1
zpe.correction: 0.180041 hartree
zpe.thermalcorrener: 0.192206 hartree
zpe.thermalcorrenthalpy: 0.193150 hartree
zpe.thermalcorrgfe: 0.140294 hartree
zpe.sumelectzpe: -498.801488 hartree
zpe.sumelectthermal: -498.789323 hartree
zpe.sumelectthermalent: -498.788379 hartree
zpe.sumelectthermalfe: -498.841235 hartree
dipole: -3.4961 1.5398 -0.9746
dipole: 3.9426
quadrupole: -63.0149 -59.3069 -63.8635
quadrupole: 6.5658 2.0023 -1.1698
quadrupole: -0.9531 2.7549 -1.8018 6.5658 2.0023 -1.1698
hfenergy: -498.981529 hartree
pointgroup: C01 [X(C7H12O3)]
dipole: 1.465741 0.4906309 0.1299987 debye
dipolederiv: -1.5227019 0.158787 -0.197816 0.2319072 -0.3432502 0.0348261 -0.3285497 0.0572332 -0.560853 -0.6451077 0.1063787 0.0727086 0.0552315 -0.3484531 -0.1215932 -0.2364456 -0.0852372 -0.8499414 -0.9533889 -0.1907248 0.1082352 -0.1240881 -0.3600681 -0.000334 0.2185648 0.0362541 -0.4430688 -0.5323092 -0.041763 0.0213198 -0.056823 -0.3168536 -0.1053141 -0.1294903 -0.1801284 -0.0841505 0.0529078 -0.0205089 0.0141994 -0.0263043 0.3977538 0.0260369 0.0480098 -0.0456901 0.0982577 1.6528339 -0.3877873 0.142045 -0.3490144 0.2388078 0.1316008 0.523388 0.0842717 1.0862424 0.0786822 0.0037868 -0.0005257 0.0324912 -0.0358101 0.0564483 -0.0200134 0.056906 -0.0579946 1.1975682 0.4093011 -0.1199608 0.3795965 0.2821088 0.1037498 0.0686157 0.1856915 0.5797001 0.8147256 -0.0428854 -0.0151317 -0.0866695 0.3376983 -0.0652608 -0.2005115 0.0068468 0.2529816 -0.1083431 -0.0396347 0.0242448 -0.0378269 -0.0906226 0.0842341 0.0824992 0.03572 0.0269713 0.0288197 0.0033663 -0.0078514 0.0030351 0.0705892 0.0515819 -0.0096335 0.0551634 -0.030821 -0.0282101 0.0634826 0.1141266 0.0595659 0.0069504 -0.0122073 0.0794992 -0.0071072 -0.0185492 -0.0509524 -0.0723352 -0.1092069 -0.0766408 -0.0137288 -0.0124419 -0.0909609 -0.0033792 0.010514 -0.0406299 0.0258386 0.103041 0.0366433 0.1054751 -0.0509015 0.0875228 -0.0187719 -0.0039872 -0.0867834 -0.0487152 -0.0905213 -0.0909451 0.0740382 -0.0374452 -0.068856 -0.0090453 0.0307839 0.1014456 0.0145041 -0.0078264 0.02218 -0.1856321 0.0160397 -0.0043626 -0.004817 0.0822985 0.0430438 -0.0189603 0.0436296 -0.0279175 0.0857608 -0.0751844 -0.0175108 -0.1096116 -0.1369138 -0.0440358 0.0479592 -0.037671 0.0533478 0.0216864 0.0807896 -0.0490012 0.119356 -0.026391 0.0014309 -0.0608576 -0.0350264 -0.0068688 -0.0133531 -0.056258 0.0678894 -0.1192162 0.0040996 -0.143365 0.0550612 0.078241 0.041493 0.0780489 -0.0282899 0.0979143 -0.0210635 0.0942283 0.064683 0.0560147 -0.1006808 0.0191929 0.0275632 0.0647442 -0.0857208 0.0843196 -0.0089287 0.119687 -0.0203079 0.0004275 -0.051586 -0.0187093 -0.084821 -0.0328469 -0.1176947 -0.0444782 unknown
polarizability: 104.9015832|-1.9306125|73.1266044|-2.5761287|0.5689613|74.3501533 unknown
InChI: InChI=1S/C7H12O3/c1-3-6(5-8)7(9)10-4-2/h5-6H,3-4H2,1-2H3
charge 0 multiplicity 1
22 atoms
O  1.404067 -0.497435 0.782922
O  0.359343 -0.565645 -1.307343
O  -3.261018 -0.596775 0.757032
C  -0.916962 0.092142 0.702225
C  -1.037479 1.665002 0.691077
C  0.311162 -0.35707 -0.070476
C  -1.228217 2.28913 -0.707337
C  -2.190668 -0.519332 0.110761
C  2.708357 -0.883426 0.151255
C  3.469155 0.360787 -0.312728
H  -0.82512 -0.215731 1.758941
H  -1.897911 1.915889 1.339259
H  -0.129581 2.072948 1.173855
H  -0.409333 2.014854 -1.395172
H  -2.177255 1.9642 -1.170564
H  -1.255301 3.390568 -0.627223
H  -2.113382 -0.869359 -0.946468
H  3.235824 -1.417268 0.957445
H  2.499338 -1.567565 -0.689651
H  4.465221 0.067278 -0.69277
H  2.929342 0.872031 -1.127677
H  3.614417 1.06848 0.521639
