program: Gaussian 09
title: 000289296
version: EM64L-G09RevD.01
frameworkgroup: C1[X(C11H12BrNO)]
method: RPBEPBE
basis: SDD
operation: Freq
keyword: #p
keyword: freq=noraman
keyword: PBEPBE/SDD
title: #p freq=noraman PBEPBE/SDD
converged: NO YES NO NO
title: Mulliken charges:
elementType: Br O N C C C C C C C C C C C H H H H H H H H H H H H
charge: 0.034290 -0.292698 -0.088965 0.183257 -0.376283 -0.710923 -0.710906 0.097918 0.378634 -0.351766 -0.325659 -0.189690 -0.231767 -0.225311 0.228908 0.228935 0.204532 0.227407 0.238993 0.227365 0.204581 0.239129 0.285077 0.252130 0.235166 0.237645
chargesum: 0.00000
title: Mulliken charges with hydrogens summed into heavy atoms:
elementType: Br O N C C C C C C C C C C C
charge: 0.034290 -0.292698 -0.088965 0.183257 0.081561 -0.039991 -0.039831 0.097918 0.378634 -0.351766 -0.040581 0.062440 0.003399 0.012334
polarizability: 1.95110419e+02 1.86743066e+01 1.65319850e+02 1.53799388e-02 7.48121470e-03 7.75161054e+01
1716.lowfreq: -15.8125 -12.2401 -4.8182 0.0003 0.0005 0.0006 5.8341 31.2051 79.2322
frequency: -13.7101 30.9305 79.2152 93.3193 133.9854 198.6398 205.3451 223.2176 237.6543 252.7018 312.1826 321.5612 369.4113 393.0156 412.4335 462.9686 481.4142 520.4856 600.1672 632.4328 651.2937 691.7942 730.5988 772.8290 795.2307 830.3066 856.7288 882.0492 918.4410 928.9548 948.6470 960.7202 967.9946 982.2968 998.1649 1011.2440 1019.1407 1052.5062 1128.4065 1145.7195 1167.3335 1176.8913 1205.1785 1242.2175 1258.9912 1269.1882 1315.8702 1368.4064 1374.3830 1391.8526 1413.3188 1451.4695 1461.4851 1465.6903 1468.7776 1477.0059 1487.9723 1564.8569 1596.4280 1610.5712 2980.1777 2983.7020 3016.9900 3076.3065 3081.7631 3083.8254 3096.4525 3099.8458 3139.2005 3156.1978 3171.5809 3184.0965
redmass: 5.7949 3.0115 3.5623 6.6822 4.2401 4.8270 1.0765 4.4762 5.0769 1.1256 3.6920 2.3235 3.2848 4.3124 3.1954 3.5585 4.2201 4.0588 4.4226 6.5447 5.7929 6.8717 3.4886 1.3602 6.0857 5.1050 3.6757 1.3672 1.6781 7.6425 1.2547 3.0188 1.3728 3.4124 1.3397 1.3599 7.2874 2.0509 1.6475 1.2024 2.2953 1.0763 2.5130 2.7327 2.6324 1.6957 1.3814 8.6751 1.2095 1.2053 2.0738 1.0494 2.4614 1.0483 1.0594 1.0791 1.0638 6.1967 7.3309 9.7482 1.0355 1.0361 1.0570 1.1001 1.0995 1.1099 1.1018 1.0994 1.0863 1.0917 1.0965 1.0971
irintensity: 0.0001 0.0578 2.9149 0.9616 2.7483 0.6552 0.0080 0.3664 0.7985 0.0647 0.5487 2.1965 2.0349 0.2051 1.1639 3.9424 7.7993 3.8732 5.2446 7.9844 15.3791 16.6364 11.0025 72.3395 3.4696 21.0204 6.1016 0.7100 0.1092 44.3494 1.5483 66.3881 2.7856 64.3061 0.4182 0.1781 27.2967 0.2514 5.4758 0.1740 46.1553 3.9543 10.0926 10.8764 37.4800 7.6808 26.6273 7.6694 21.2477 8.5517 23.5231 3.7393 56.0880 3.9947 8.1992 16.4753 5.9460 16.3185 7.4831 98.8091 22.3800 28.7599 51.2381 10.4641 54.0600 16.3154 18.6880 34.1071 2.3470 12.7401 11.4392 8.6395
temp: 298.150 k
press: 1.00000 atm
elementType: 35 8 7 6 6 6 6 6 6 6 6 6 6 6 1 1 1 1 1 1 1 1 1 1 1 1
symmnumber: 1
zpe: 532769.9 jmol-1
zpe.correction: 0.202921 hartree
zpe.thermalcorrener: 0.215543 hartree
zpe.thermalcorrenthalpy: 0.216487 hartree
zpe.thermalcorrgfe: 0.162742 hartree
zpe.sumelectzpe: -568.763960 hartree
zpe.sumelectthermal: -568.751338 hartree
zpe.sumelectthermalent: -568.750394 hartree
zpe.sumelectthermalfe: -568.804139 hartree
dipole: -0.8995 1.9840 -0.0002
dipole: 2.1784
quadrupole: -71.0311 -89.7032 -94.3270
quadrupole: 2.1459 0.0123 0.0184
quadrupole: 13.9893 -4.6828 -9.3066 2.1459 0.0123 0.0184
hfenergy: -568.9668809 hartree
pointgroup: C01 [X(C11H12Br1N1O1)]
dipole: -0.1966168 0.8269603 0.1095848 debye
dipolederiv: -0.0581149 -0.1978809 -0.0236693 -0.1692699 -0.5717088 -0.0653717 -0.0201016 -0.0647087 -0.0203705 -0.8581687 0.3695668 0.0633863 0.150204 -0.844975 -0.0794635 0.0366047 -0.0864059 -0.23936 -0.8298117 -0.0862339 0.0032745 -0.1021921 -0.5051161 -0.0133385 0.0008912 -0.0144486 -0.3686702 0.4837285 0.0808894 0.00437 -0.0446103 0.1320332 -0.0192615 -0.0110231 -0.0226092 0.2969571 0.4153221 -0.250882 -0.0341964 -0.0834186 0.088993 -0.0204927 -0.0132338 -0.0160497 0.2766865 -0.0463615 -0.0450644 -0.0387808 0.0587013 0.0562705 -0.0117021 0.0042628 -0.0050475 -0.061658 -0.0446029 -0.0511682 0.0262109 0.0598738 0.0449267 0.0349021 0.008833 0.0347895 -0.0534088 1.0793305 -0.2835037 -0.0647425 -0.1991332 1.0144791 0.119838 -0.0532036 0.1235194 0.0916379 -0.1753294 -0.047979 0.0011273 0.061673 -0.302405 -0.0492187 0.0145243 -0.0459446 0.0704476 0.1969982 0.5048381 0.0543737 0.1371705 0.9653732 0.1322224 0.0081914 0.1213523 -0.1024848 0.0399899 -0.0095801 -0.0059775 0.0303546 -0.037857 0.0099073 -0.0013271 0.0111239 -0.1213688 -0.17808 -0.2586262 -0.0303953 -0.2180155 -0.2244618 -0.0090195 -0.0252915 -0.0077877 -0.1015452 -0.1113263 0.1551427 0.0182032 0.1451406 0.0219386 0.018902 0.0171203 0.0186552 -0.159107 0.0739004 -0.0446057 -0.0117678 0.0274024 0.119024 0.0314461 -0.0027756 0.0335368 -0.132896 -0.0219983 0.0734778 -0.0300187 0.066641 0.0095728 0.0814874 -0.082649 0.1272178 -0.0431635 -0.0143851 0.0575924 0.0428856 0.0417106 0.0555799 -0.059648 0.0925365 -0.1059303 -0.0957393 -0.1802113 0.0640027 -0.0152665 0.1040968 0.0521919 -0.0095661 -0.0085193 -0.0357515 0.0683041 0.0499997 -0.0484684 0.0955549 -0.0502464 0.0435545 0.0872346 0.0593043 0.0587034 -0.0784116 0.1137139 -0.0001112 -0.012011 -0.0567311 -0.1170088 -0.0502202 -0.0121904 0.0011565 0.0846744 0.0393991 -0.026279 -0.1126261 -0.0379371 0.0697987 -0.0497355 -0.077995 -0.0214905 -0.0942564 -0.1771945 0.0579515 0.0453183 0.0969316 0.0444683 -0.0022551 0.0484311 0.0262833 0.07321 0.1151399 -0.0037048 0.0098309 -0.0552509 -0.1173073 0.0045236 -0.0032354 -0.0502349 0.0840944 0.1333242 0.03036 0.0045992 0.0601235 0.0057782 -0.0210424 0.0084577 -0.0202238 0.1554494 0.0508663 0.051923 0.0096642 0.0815524 -0.0184587 -0.0244841 0.0134529 -0.0235517 0.1533602 0.0230218 -0.07915 -0.0059727 -0.103573 -0.0618094 -0.0250269 -0.0091008 -0.0258776 0.1575007 -0.1191497 -0.0125072 0.0066257 -0.001198 0.0771254 -0.0106172 0.0080361 -0.010276 0.1601179 unknown
polarizability: 200.9645863|12.0017957|158.1748105|-2.1312203|9.7772512|78.8069775 unknown
InChI: InChI=1S/C11H12BrNO/c1-11(2)7-14-10(13-11)8-5-3-4-6-9(8)12/h3-6H,7H2,1-2H3
charge 0 multiplicity 1
26 atoms
Br 0.912249 -2.811899 -0.425408
O  -0.971459 1.596185 0.179207
N  -1.38581 -0.683851 -0.088068
C  -2.754769 -0.055771 0.030583
C  -2.460505 1.480776 0.207517
C  -3.545539 -0.34959 -1.26373
C  -3.466034 -0.656027 1.263787
C  -0.48718 0.258219 0.000646
C  0.987448 0.160613 -0.054418
C  1.730294 -1.043206 -0.227043
C  1.728678 1.374012 0.076997
C  3.142445 -1.027157 -0.26643
C  3.134288 1.395241 0.038914
C  3.847642 0.188105 -0.134034
H  -2.856038 2.094361 -0.619697
H  -2.804783 1.878242 1.177424
H  -4.560797 0.086131 -1.205536
H  -3.029925 0.072453 -2.14466
H  -3.637774 -1.439266 -1.410507
H  -2.895687 -0.449555 2.186922
H  -4.480982 -0.229424 1.372206
H  -3.55364 -1.750335 1.153186
H  1.162242 2.298863 0.210288
H  3.685661 -1.96688 -0.400827
H  3.667811 2.345428 0.143458
H  4.942263 0.182433 -0.166673
