program: Gaussian 09
title: 000289322
version: EM64L-G09RevD.01
frameworkgroup: C1[X(C20H24O4)]
method: RPBEPBE
basis: SDD
operation: Freq
keyword: #pfreq=noraman
keyword: PBEPBE/SDD
title: #p freq=noraman PBEPBE/SDD
converged: YES YES NO NO
title: Mulliken charges:
elementType: O O O O C C C C C C C C C C C C C C C C C C C C H H H H H H H H H H H H H H H H H H H H H H H H
charge: -0.286344 -0.272489 -0.445889 -0.261483 0.134287 0.500444 -0.747097 -0.700484 -0.698652 -0.378102 -0.424709 0.359646 -0.423024 -0.371799 -0.284927 -0.452813 -0.295398 0.378695 -0.332356 -0.369689 0.248806 -0.355953 -0.302372 0.107913 0.215481 0.216961 0.216095 0.214297 0.206659 0.222241 0.206194 0.214371 0.223217 0.227297 0.244342 0.243375 0.244175 0.230430 0.215649 0.218837 0.217354 0.220545 0.242311 0.255722 0.252585 0.269161 0.275111 0.381379
chargesum: 0.00000
title: Mulliken charges with hydrogens summed into heavy atoms:
elementType: O O O O C C C C C C C C C C C C C C C C C C C C
charge: -0.286344 -0.272489 -0.064510 -0.261483 0.134287 0.500444 -0.098561 -0.057286 -0.054871 -0.150805 -0.180367 0.359646 -0.179648 -0.127623 0.161151 -0.016622 0.167458 0.378695 -0.076634 -0.117104 0.248806 -0.086791 -0.027261 0.107913
polarizability: 2.79806104e+02 -1.57432894e+01 2.24705077e+02 -9.10373532e+00 1.00492278e+00 2.10721457e+02
1716.lowfreq: -7.8478 -0.0007 -0.0004 0.0006 2.1091 5.4485 9.8891 20.8151 23.4876
frequency: 8.0288 20.8021 23.4274 32.3256 52.1177 67.8057 78.7822 85.4793 108.4970 127.9380 135.7190 184.7626 193.1741 203.3961 212.0742 226.5681 244.9299 254.5897 277.6704 288.4236 305.2437 318.3897 326.3004 350.7735 379.0918 413.3757 416.5811 417.8976 427.8057 432.8399 458.7860 482.3294 498.3596 503.5483 536.7023 549.1025 583.8411 584.3290 626.3709 633.3194 659.6660 684.3705 699.3672 736.4700 756.1172 761.2888 799.7175 814.8921 827.5462 834.5075 835.7918 847.7067 854.8829 897.0469 917.6429 933.6674 938.0705 941.3718 944.3006 958.8843 964.0439 978.5481 986.8439 993.8927 1002.0820 1018.8733 1020.7029 1025.7435 1048.0176 1086.6104 1111.3102 1118.2068 1122.8212 1124.6669 1150.1344 1183.0522 1184.9254 1201.9270 1202.8801 1204.2556 1216.3978 1225.6730 1236.9470 1272.4395 1285.6990 1302.4869 1308.4752 1322.1141 1355.4835 1363.2478 1371.1017 1374.9629 1376.7212 1381.4288 1385.2422 1403.0774 1415.3412 1431.2745 1436.8836 1459.6660 1465.2255 1467.7279 1470.3120 1477.1306 1479.6783 1485.9583 1495.9052 1499.8982 1504.8435 1574.0553 1581.1676 1619.8062 1622.7437 1641.2719 2968.1273 2971.2969 2971.5353 2977.1064 2977.9934 3009.5949 3035.0829 3050.5926 3065.6982 3066.8615 3068.6629 3073.5790 3075.3007 3077.2895 3080.3184 3128.5149 3144.9624 3151.5673 3159.9439 3159.9729 3166.9688 3173.6481 3182.7078 3534.1034
redmass: 5.9584 3.3375 4.6198 5.6076 4.3213 4.4420 5.9980 5.6383 4.9415 3.9016 5.6018 3.1497 2.7570 1.3488 3.0532 3.3524 2.4724 1.1564 2.5733 5.7758 1.1027 2.5415 3.5530 2.4977 2.7352 2.9778 2.9852 3.4849 5.0023 3.6249 2.9423 3.1089 2.7346 5.6382 3.1188 2.3195 3.0427 1.3921 6.9151 6.7590 4.2540 3.5797 4.3522 3.6320 4.6243 3.0677 4.7441 1.3560 1.3727 2.2750 1.6280 2.1617 1.7531 3.1970 1.7592 1.6511 1.5227 1.4479 1.6764 3.3531 1.3594 1.3626 1.3509 4.2161 2.8198 2.7757 1.4284 1.3766 2.1037 1.8529 2.2992 1.3260 1.5309 1.9758 1.6089 1.4389 1.2996 1.1245 1.1690 2.7728 2.6142 2.4063 3.3250 3.1508 1.1516 1.2884 1.2925 2.9492 1.4044 3.1158 1.9825 1.2236 1.1932 2.3155 1.8935 1.2042 3.5460 4.3275 1.0924 1.0509 1.0496 1.0867 1.1417 1.1287 1.0706 1.0567 1.1225 2.3900 1.8994 7.5694 6.9679 6.2910 6.3848 8.4368 1.0566 1.0348 1.0347 1.0359 1.0567 1.0639 1.1047 1.1058 1.0999 1.0998 1.1005 1.1020 1.0984 1.0995 1.0991 1.0875 1.0866 1.0886 1.0921 1.0917 1.0954 1.0955 1.0972 1.0641
irintensity: 0.0508 0.0793 0.0963 0.4347 0.4810 0.5601 1.0024 0.3340 0.1973 0.6346 1.3554 8.9424 4.0700 1.2721 1.8851 3.6419 1.5483 0.1278 2.0228 6.7247 0.1536 0.8372 0.9639 1.0670 0.7310 0.0129 0.2830 0.6670 3.5894 0.1269 1.4223 6.0647 37.0950 4.6397 5.9352 22.1849 62.6849 86.0599 3.9558 0.0908 10.8133 70.5965 2.4307 1.6310 23.0222 12.0508 3.5713 15.5122 2.9534 6.4594 54.8315 5.9898 68.6050 5.1732 3.8700 2.2070 32.1064 33.6037 57.3553 61.7369 2.1072 3.4510 0.4218 134.7054 13.0436 197.6556 3.7312 0.3026 47.0324 3.7788 4.9133 12.7245 11.3613 8.2231 244.4800 164.9208 26.1781 2.5788 27.9129 3.8570 3.9418 233.9737 191.7810 49.0345 7.4486 2.1431 0.1594 166.0822 1.5771 7.7757 7.2811 25.1272 19.8908 17.6970 28.8874 10.7011 5.5698 3.1796 16.1616 0.1056 0.9595 28.9884 71.8817 49.5333 26.8457 12.3728 1.4578 52.5184 126.5955 0.0915 14.5903 290.3790 61.3613 288.0336 35.2603 33.6399 34.0825 35.4793 25.1993 18.1970 39.4576 41.5105 4.6718 6.1445 16.3968 31.5080 130.7352 35.9246 45.6782 20.0186 15.2474 1.7769 5.8157 13.6976 6.5683 10.4171 3.0843 48.2769
temp: 298.150 k
press: 1.00000 atm
elementType: 8 8 8 8 6 6 6 6 6 6 6 6 6 6 6 6 6 6 6 6 6 6 6 6 1 1 1 1 1 1 1 1 1 1 1 1 1 1 1 1 1 1 1 1 1 1 1 1
symmnumber: 1
zpe: 1034926.3 jmol-1
zpe.correction: 0.394183 hartree
zpe.thermalcorrener: 0.418039 hartree
zpe.thermalcorrenthalpy: 0.418983 hartree
zpe.thermalcorrgfe: 0.337402 hartree
zpe.sumelectzpe: -1075.642382 hartree
zpe.sumelectthermal: -1075.618526 hartree
zpe.sumelectthermalent: -1075.617581 hartree
zpe.sumelectthermalfe: -1075.699163 hartree
dipole: -2.3778 2.1622 1.5131
dipole: 3.5522
quadrupole: -154.1811 -133.5155 -137.7035
quadrupole: 7.9233 6.7298 -4.2334
quadrupole: -12.3811 8.2846 4.0965 7.9233 6.7298 -4.2334
hfenergy: -1076.0365647 hartree
pointgroup: C01 [X(C20H24O4)]
dipole: 1.0261315 0.8426757 -0.4360404 debye
polarizability: 281.8172997|14.14928|223.7567291|0.4457733|1.618585|209.6586087 unknown
InChI: InChI=1S/C20H24O4/c1-20(2,3)16-7-11-18(12-8-16)24-14-4-13-23-17-9-5-15(6-10-17)19(21)22/h5-12,21H,4,13-14H2,1-3H3
charge 0 multiplicity 1
48 atoms
O  1.036968 1.997911 0.676309
O  -2.26811 1.979248 -0.905201
O  -6.793397 -2.385461 -2.02019
O  -7.189929 -2.132624 0.254372
C  5.461904 -1.76624 0.437103
C  4.300391 -0.744615 0.441524
C  6.140807 -1.880298 -0.952058
C  6.541577 -1.331095 1.473847
C  4.914268 -3.17284 0.826485
C  3.563643 -0.513131 1.639359
C  3.909509 -0.0114 -0.703709
C  2.121742 1.113578 0.526692
C  2.494159 0.3967 1.690511
C  2.834881 0.91048 -0.676409
C  0.588357 2.738952 -0.516277
C  -0.632918 3.555476 -0.085816
C  -1.818328 2.678801 0.321077
C  -3.315912 1.064671 -0.800071
C  -4.002345 0.768392 0.408349
C  -3.683553 0.417254 -2.010172
C  -5.42076 -0.826103 -0.809342
C  -5.047337 -0.17341 0.392946
C  -4.726393 -0.520097 -2.013315
C  -6.52611 -1.807878 -0.762859
H  6.583983 -0.919028 -1.272255
H  6.955575 -2.625931 -0.906158
H  5.427308 -2.211928 -1.729225
H  6.124141 -1.265616 2.494748
H  7.372119 -2.06205 1.493851
H  6.957406 -0.340069 1.214947
H  5.735317 -3.914603 0.836894
H  4.450489 -3.167315 1.82919
H  4.150118 -3.510437 0.102607
H  3.82684 -1.056344 2.554404
H  4.441689 -0.150107 -1.649616
H  1.934219 0.565336 2.615802
H  2.570812 1.450625 -1.590534
H  0.317534 2.028815 -1.322057
H  1.401274 3.404086 -0.871538
H  -0.356517 4.195484 0.772999
H  -0.935756 4.217937 -0.918056
H  -2.651446 3.292914 0.71658
H  -1.508021 1.935931 1.080137
H  -3.730425 1.257596 1.347384
H  -3.136894 0.666344 -2.9244
H  -5.590486 -0.419276 1.311504
H  -5.015811 -1.025206 -2.938686
H  -7.541978 -3.031128 -1.913482
