program: Gaussian 09
title: 000289292
version: EM64L-G09RevD.01
frameworkgroup: C1[X(C11H13N3O2S)]
method: RPBEPBE
basis: SDD
operation: Freq
keyword: #p
keyword: freq=noraman
keyword: PBEPBE/SDD
title: #p freq=noraman PBEPBE/SDD
converged: NO YES NO NO
title: Mulliken charges:
elementType: S O O N N N C C C C C C C C C C C H H H H H H H H H H H H H
charge: 0.933621 -0.524374 -0.531505 -0.121883 -0.258758 -0.528774 -0.218780 -0.221105 -0.267797 -0.132534 -0.487458 -0.006068 -0.244396 -0.266139 -0.202680 -0.204395 -0.215490 0.300209 0.261799 0.274884 0.309244 0.239912 0.228888 0.267831 0.308986 0.281881 0.297579 0.242992 0.244686 0.239621
chargesum: 0.00000
title: Mulliken charges with hydrogens summed into heavy atoms:
elementType: S O O N N N C C C C C C C C C C C
charge: 0.933621 -0.524374 -0.531505 -0.121883 0.009073 -0.219788 0.081429 0.040695 0.007088 0.176711 -0.018659 -0.006068 0.037485 0.031440 0.040312 0.040291 0.024131
polarizability: 1.92659120e+02 -1.83489293e+01 1.48482002e+02 -5.42998715e+00 -8.39247360e+00 1.45429981e+02
1716.lowfreq: -10.3280 0.0003 0.0014 0.0020 2.9947 15.3834 24.5347 27.8413 33.7139
frequency: 24.1568 26.8761 33.6667 88.8249 101.9278 145.5012 166.9604 204.7088 216.1973 247.9952 282.2653 342.8005 372.7883 404.3683 419.7386 429.7848 476.4567 490.0835 506.6467 559.0743 598.9536 602.7258 657.0967 671.3044 690.7291 712.6389 733.4450 761.6564 785.7973 795.4318 802.1365 828.8105 850.9137 894.0499 906.3695 914.1032 921.0724 936.0078 941.0903 961.9970 978.3530 985.1695 1006.4355 1006.8886 1009.1411 1023.5026 1036.2290 1039.4860 1050.9423 1078.6530 1094.9609 1104.1546 1126.4555 1154.9611 1174.5323 1179.4570 1204.1038 1222.5080 1240.7308 1267.1133 1268.3578 1302.0650 1305.6386 1341.6176 1377.7256 1385.1450 1437.5415 1454.3910 1466.1897 1578.4411 1604.7794 3019.2434 3070.0638 3081.0768 3139.3218 3144.0532 3149.6827 3158.0940 3167.7369 3176.9006 3196.7310 3210.0386 3356.3209 3382.7954
redmass: 4.9636 4.6686 4.1918 7.1199 5.6290 6.9905 4.7988 6.6854 8.1390 9.3213 3.6345 7.1652 7.5205 2.8276 3.1400 4.3167 3.8008 3.0766 3.7397 4.0992 3.7972 6.4783 6.4423 5.5560 2.3400 4.0194 3.8314 1.4552 3.8306 3.1409 13.5262 2.4372 1.2449 3.5330 2.0236 2.1206 2.0770 1.4123 5.5093 1.5333 5.7757 1.4112 1.6719 1.7947 3.6676 1.6257 1.2855 1.5490 2.1464 1.5632 1.8448 1.6601 1.4818 1.8547 1.0564 1.1247 2.1013 1.4869 1.4917 1.5672 1.2477 1.9205 1.3088 1.3529 1.2487 8.3528 2.2538 2.0295 1.0952 5.8165 6.9364 1.0603 1.0858 1.1047 1.0859 1.0920 1.0887 1.0929 1.0969 1.1015 1.0919 1.0998 1.0740 1.0763
irintensity: 0.8861 1.7394 0.3519 1.3443 1.2125 1.4682 0.1414 7.2087 1.9653 8.5299 7.6473 0.5395 16.0945 0.0715 17.2158 103.4715 14.2761 59.6248 40.6231 26.0149 6.8064 0.0203 4.7793 24.1643 33.2351 26.8180 38.7588 78.9356 34.8505 6.7953 67.5851 67.5374 0.4551 10.5771 4.7613 32.5248 12.5472 6.5303 44.7711 41.8855 1.6932 0.1213 1.0752 2.3405 0.9842 9.9766 2.9545 0.8127 27.2598 4.2580 2.7865 3.0202 13.9180 14.6374 0.1525 6.3087 7.1120 25.4084 2.4759 12.5979 9.8402 3.8167 3.4169 14.4529 7.8228 6.2923 16.8698 14.0102 19.1253 2.3284 0.3377 25.3559 5.1179 28.1452 1.2516 9.1173 10.5137 1.6169 4.2308 23.6528 2.8532 2.6769 15.0230 0.2658
temp: 298.150 k
press: 1.00000 atm
elementType: 16 8 8 7 7 7 6 6 6 6 6 6 6 6 6 6 6 1 1 1 1 1 1 1 1 1 1 1 1 1
symmnumber: 1
zpe: 599717.2 jmol-1
zpe.correction: 0.228420 hartree
zpe.thermalcorrener: 0.243455 hartree
zpe.thermalcorrenthalpy: 0.244399 hartree
zpe.thermalcorrgfe: 0.184117 hartree
zpe.sumelectzpe: -1138.213382 hartree
zpe.sumelectthermal: -1138.198348 hartree
zpe.sumelectthermalent: -1138.197404 hartree
zpe.sumelectthermalfe: -1138.257686 hartree
dipole: 0.8111 -3.8339 -3.7507
dipole: 5.4244
quadrupole: -89.4775 -117.0057 -107.9059
quadrupole: -14.5649 9.3878 0.8882
quadrupole: 15.3189 -12.2093 -3.1095 -14.5649 9.3878 0.8882
hfenergy: -1138.4418027 hartree
pointgroup: C01 [X(C11H13N3O2S1)]
dipole: -0.3582047 1.9149697 -0.8712693 debye
polarizability: 192.258881|-18.9005593|143.0503308|-3.1932358|8.5332863|151.2618904 unknown
InChI: InChI=1S/C11H13N3O2S/c15-17(16,7-4-2-1-3-5-7)13-10-8-6-9-11(10)14(9)12-8/h1-5,8-13H,6H2
charge 0 multiplicity 1
30 atoms
S  -0.791228 -1.468403 -0.35208
O  -0.314979 -2.088553 1.082911
O  -1.237572 -2.422834 -1.590826
N  3.651968 0.39318 0.952216
N  3.074299 1.741678 0.556561
N  0.542284 -0.37213 -1.100915
C  2.540626 -0.573842 0.523831
C  3.744324 -0.422779 -0.403801
C  2.330859 1.377747 -0.698849
C  1.402557 0.271937 -0.087345
C  3.359309 0.543147 -1.529345
C  -2.135906 -0.198354 0.012687
C  -2.904074 0.278762 -1.061632
C  -2.333078 0.171938 1.352091
C  -3.930318 1.204744 -0.765557
C  -3.364015 1.101652 1.625257
C  -4.154374 1.615763 0.5709
H  2.336499 -1.427925 1.168563
H  4.562655 -1.139367 -0.466936
H  1.828335 2.226548 -1.177305
H  0.765565 0.722491 0.691424
H  4.211893 1.155159 -1.873419
H  2.91042 0.044768 -2.406164
H  3.881173 2.365012 0.376948
H  1.053677 -1.019029 -1.73359
H  -2.716608 -0.069067 -2.082139
H  -1.717615 -0.267278 2.144185
H  -4.552953 1.599813 -1.574792
H  -3.548603 1.416727 2.657316
H  -4.952419 2.332897 0.791204
