program: Gaussian 09
title: 000289362
version: EM64L-G09RevD.01
frameworkgroup: C1[X(C20H23NO6)]
method: RPBEPBE
basis: SDD
operation: Freq
keyword: #p
keyword: freq=noraman
keyword: PBEPBE/SDD
title: #p freq=noraman PBEPBE/SDD
converged: YES YES NO NO
title: Mulliken charges:
elementType: O O O O O O N C C C C C C C C C C C C C C C C C C C C H H H H H H H H H H H H H H H H H H H H H H H
charge: -0.303903 -0.225926 -0.438127 -0.205257 -0.178061 -0.249445 0.009098 0.171283 -0.364864 0.481462 -0.712419 -0.780813 -0.717344 -0.389130 -0.400934 -0.410335 -0.394934 0.388421 -0.251895 -0.370391 0.263095 0.252563 -0.283898 -0.431854 0.283912 -0.384358 0.113494 0.196197 0.195064 0.224247 0.208285 0.213208 0.217037 0.218399 0.223103 0.231975 0.213083 0.218527 0.250917 0.226656 0.239534 0.243182 0.215590 0.243165 0.246159 0.229480 0.290942 0.320263 0.276109 0.389441
chargesum: 0.00000
title: Mulliken charges with hydrogens summed into heavy atoms:
elementType: O O O O O O N C C C C C C C C C C C C C C C C C C C C
charge: -0.303903 -0.225926 -0.048686 -0.205257 -0.178061 -0.249445 0.009098 0.171283 0.026397 0.481462 -0.066679 -0.122274 -0.053759 -0.138214 -0.174278 -0.170801 -0.151751 0.388421 0.206860 0.105248 0.263095 0.252563 0.007044 -0.111591 0.283912 -0.108249 0.113494
polarizability: 3.19671937e+02 1.14962249e+01 2.81486130e+02 9.73346574e+00 -1.21746716e+01 1.74029767e+02
1716.lowfreq: -6.4034 -0.0009 -0.0008 -0.0005 0.6880 3.6820 10.9154 17.3063 23.5506
frequency: 10.8341 17.0572 23.3534 36.0609 44.5425 48.9896 57.0227 66.1883 85.4906 92.5889 113.9170 128.9106 138.5674 146.9416 155.3201 187.9181 216.9348 230.8527 239.1791 247.3079 259.0553 269.9392 295.1252 309.1191 312.4248 337.2009 348.8116 358.3534 371.0562 382.8701 410.6223 413.1094 436.8575 462.2115 466.9754 474.9759 480.0323 510.4851 535.3476 555.9282 571.6785 578.0663 608.4082 630.6003 652.0761 655.2790 668.0757 693.5433 733.4356 734.2321 743.8359 752.3895 765.5900 780.8836 813.7321 822.9632 834.8759 845.9194 859.6630 897.1430 910.6456 913.5000 933.6549 942.8103 951.5983 964.2262 988.3751 989.2316 1002.3351 1010.2766 1015.0253 1021.2289 1043.9286 1049.2862 1065.5488 1068.8971 1102.4384 1114.1789 1126.1396 1155.5657 1166.5155 1168.6882 1184.5555 1208.5587 1208.8517 1212.2221 1221.9609 1234.6322 1240.5444 1271.4605 1282.1202 1301.9025 1311.5757 1324.5200 1329.4975 1359.7436 1361.1557 1367.4224 1377.6011 1380.0119 1381.9626 1390.6461 1398.9767 1412.9762 1424.8776 1458.4892 1461.2122 1463.3257 1467.1557 1474.2479 1479.2493 1484.4991 1487.2069 1492.7471 1498.0039 1501.4115 1564.9061 1583.7691 1618.0694 1620.8857 1643.1431 2956.8126 2969.6343 2973.0559 2978.1840 2981.8959 3015.8609 3019.3425 3032.3899 3066.0088 3069.9901 3072.1619 3077.2133 3078.8844 3081.1170 3097.2504 3128.2526 3146.7743 3157.5694 3158.5715 3168.9371 3184.9288 3192.0348 3536.0736
redmass: 6.3850 5.1782 4.4022 5.3398 13.4180 3.5481 6.9002 4.4349 5.6573 3.5110 3.5635 5.9700 5.1160 4.2094 4.8139 2.0469 3.1936 1.5714 1.4454 1.9144 4.0194 3.4574 4.1428 1.1566 7.0282 4.1438 2.7588 3.7760 3.5161 4.6756 3.4420 2.9514 4.2828 3.0382 3.5607 3.1968 4.9641 3.2654 3.0258 2.3615 5.4310 2.0137 2.0194 6.4148 6.4921 4.9316 5.5567 5.3626 6.1260 3.3164 7.9494 4.1053 2.2849 1.7228 1.3823 1.9878 1.5890 1.6120 3.9597 4.3246 2.0089 3.4683 1.5270 1.3771 1.5003 1.3574 1.2849 1.3677 2.6990 1.5551 2.4827 3.6716 3.0813 1.5925 2.2003 2.6869 2.4417 2.1746 1.5037 1.7811 1.4339 2.5714 1.5054 1.4970 2.1140 3.3274 2.3838 1.9103 2.5460 1.3648 1.2671 1.5491 1.3601 1.4371 2.8591 3.3070 5.8514 1.3665 1.2441 2.2254 3.2923 1.2131 1.2228 3.2128 5.6691 1.1015 1.0615 1.1096 1.0579 1.0696 1.0456 1.0613 1.0513 2.9031 1.0605 2.2574 8.1539 7.0494 6.6017 6.4846 8.8650 1.0587 1.0563 1.0363 1.0362 1.0374 1.0705 1.1006 1.0931 1.0998 1.0996 1.0990 1.0994 1.0995 1.0993 1.1044 1.0873 1.0875 1.0943 1.0903 1.0959 1.0947 1.0928 1.0643
irintensity: 0.6738 0.3752 0.3557 0.2545 0.9105 0.0544 1.8063 0.6421 0.2738 0.5930 0.8912 0.5050 4.7325 6.0755 0.5698 0.9335 0.2747 0.3115 0.2896 0.7981 4.2048 1.9433 3.3016 0.0204 7.0697 0.8152 0.0585 0.5223 1.7272 3.9280 1.3762 0.1322 2.8806 0.4301 4.2318 7.6838 11.2279 32.8200 6.1429 18.2928 69.2678 41.0190 47.3319 3.8832 8.2123 48.8116 11.8954 21.4323 26.6900 1.9780 10.5538 15.5278 27.9447 5.1372 14.9047 3.8711 43.8540 54.7419 27.7521 28.0648 5.3042 53.6090 1.4736 0.3624 20.8501 0.3428 0.9989 1.2722 29.1712 14.9685 82.2850 273.1731 37.3841 2.9417 5.3502 45.7607 6.7646 3.1290 8.7910 73.4251 38.0081 17.2631 178.4321 106.9813 16.0988 265.4823 113.2271 9.3234 108.8155 22.3239 95.4115 28.0750 1.7247 4.5550 188.7310 11.9136 61.4291 9.2870 11.0484 25.2536 66.2321 25.7676 13.9686 2.2942 21.6679 38.5970 0.0210 31.1130 2.2644 12.3258 5.6910 6.6693 19.0637 104.1122 4.3057 133.3926 8.2337 4.0560 154.2711 51.9369 337.4411 41.1151 25.1197 46.8217 34.5739 25.1225 10.9729 23.3712 47.3007 3.6806 53.5707 25.8217 80.7845 64.5396 34.8513 10.8935 22.0899 10.0924 16.9229 2.4549 6.4719 7.6471 7.3117 60.3270
temp: 298.150 k
press: 1.00000 atm
elementType: 8 8 8 8 8 8 7 6 6 6 6 6 6 6 6 6 6 6 6 6 6 6 6 6 6 6 6 1 1 1 1 1 1 1 1 1 1 1 1 1 1 1 1 1 1 1 1 1 1 1
symmnumber: 1
zpe: 1036289.1 jmol-1
zpe.correction: 0.394702 hartree
zpe.thermalcorrener: 0.421471 hartree
zpe.thermalcorrenthalpy: 0.422415 hartree
zpe.thermalcorrgfe: 0.334060 hartree
zpe.sumelectzpe: -1279.925550 hartree
zpe.sumelectthermal: -1279.898781 hartree
zpe.sumelectthermalent: -1279.897837 hartree
zpe.sumelectthermalfe: -1279.986191 hartree
dipole: -5.1828 0.0574 -2.6498
dipole: 5.8211
quadrupole: -166.8562 -159.0870 -160.6269
quadrupole: 17.6619 -9.9211 16.1137
quadrupole: -4.6661 3.1030 1.5631 17.6619 -9.9211 16.1137
hfenergy: -1280.3202517 hartree
pointgroup: C01 [X(C20H23N1O6)]
dipole: 1.9574689 0.5909443 -1.0315958 debye
polarizability: 320.5238694|16.5101601|217.4900044|-7.1043256|52.5649447|237.1739601 unknown
InChI: InChI=1S/C20H23NO6/c1-4-20(2,3)15-6-8-16(9-7-15)26-11-12-27-18-10-5-14(19(22)23)13-17(18)21(24)25/h5-10,13,22H,4,11-12H2,1-3H3
charge 0 multiplicity 1
50 atoms
O  0.633977 1.603861 -0.024182
O  -2.001798 2.232074 1.57706
O  -6.21677 -2.105582 -0.512853
O  -5.497848 0.967967 3.16388
O  -3.316628 1.302701 3.742728
O  -4.899557 -2.014404 -2.426412
N  -4.233586 1.016473 2.885273
C  5.694884 -1.247725 -0.389424
C  6.884842 -0.243106 -0.581255
C  4.354555 -0.480445 -0.299662
C  5.923798 -2.021881 0.945608
C  5.702365 -2.283378 -1.543704
C  6.834056 0.61335 -1.86466
C  3.262029 -0.729874 -1.172885
C  4.166521 0.513533 0.695894
C  2.04409 -0.029902 -1.058681
C  2.957025 1.230045 0.82873
C  1.888663 0.95241 -0.056795
C  0.412845 2.598973 1.029341
C  -1.016621 3.115109 0.909959
C  -2.695359 1.26818 0.869647
C  -3.838805 0.678807 1.498906
C  -2.370092 0.855438 -0.451637
C  -4.647324 -0.248697 0.817092
C  -4.316732 -0.640802 -0.497709
C  -3.166896 -0.085266 -1.11937
C  -5.127152 -1.626273 -1.254303
H  7.826394 -0.829376 -0.564103
H  6.926004 0.430061 0.298298
H  5.104765 -2.740822 1.129687
H  6.876361 -2.583546 0.904929
H  5.972236 -1.335961 1.810758
H  4.936313 -3.065693 -1.388884
H  6.686888 -2.784966 -1.584449
H  5.522957 -1.81843 -2.529325
H  5.894156 1.191853 -1.920801
H  7.675309 1.330391 -1.885535
H  6.906454 -0.007196 -2.77608
H  3.350063 -1.485302 -1.958946
H  4.979211 0.744337 1.394565
H  1.208841 -0.236583 -1.735433
H  2.866452 1.984385 1.616365
H  1.116077 3.448904 0.898672
H  0.567782 2.154622 2.032421
H  -1.106605 4.056662 1.476977
H  -1.291748 3.296467 -0.145377
H  -1.460596 1.235214 -0.922149
H  -5.529325 -0.656529 1.316268
H  -2.911519 -0.412385 -2.132464
H  -6.72515 -2.755895 -1.067178
