program: Gaussian 09
title: 000289293
version: EM64L-G09RevD.01
frameworkgroup: C1[X(C11H12O4S)]
method: RPBEPBE
basis: SDD
operation: Freq
keyword: #p
keyword: freq=noraman
keyword: PBEPBE/SDD
title: #p freq=noraman PBEPBE/SDD
converged: YES YES NO NO
title: Mulliken charges:
elementType: S O O O O C C C C C C C C C C C H H H H H H H H H H H H
charge: 0.958827 -0.251669 -0.252752 -0.533468 -0.553061 -0.031095 -0.030298 -0.683029 -0.681904 -0.160558 0.349156 -0.371647 -0.371686 -0.216111 -0.216005 -0.232773 0.267793 0.266905 0.295492 0.326441 0.326374 0.295732 0.271054 0.263869 0.264095 0.232986 0.232985 0.234345
chargesum: 0.00000
title: Mulliken charges with hydrogens summed into heavy atoms:
elementType: S O O O O C C C C C C C C C C C
charge: 0.958827 -0.251669 -0.252752 -0.533468 -0.553061 0.236698 0.236607 -0.061096 -0.059798 0.110496 0.349156 -0.107778 -0.107592 0.016874 0.016980 0.001573
polarizability: 1.93306941e+02 -6.23783462e-03 1.35897968e+02 -1.26241316e+01 -1.01758156e-01 1.12003235e+02
1716.lowfreq: -7.9831 -0.0021 -0.0013 0.0012 8.0808 10.0338 25.5514 27.7327 42.5892
frequency: 25.4519 26.5278 42.4807 62.1282 157.7646 184.0871 193.1947 204.8213 242.2141 264.7701 304.6084 328.7776 392.2624 405.3795 452.5632 456.6016 483.0492 536.0652 547.6916 594.7656 604.3947 615.2127 706.1109 733.8895 739.2563 775.0377 776.5134 801.7498 809.5999 822.5145 858.8476 865.2834 888.4099 904.8555 938.5875 943.0486 983.6349 989.0087 990.5017 1002.3447 1012.9007 1030.1482 1073.8369 1081.3521 1104.0977 1129.5778 1156.8283 1173.5271 1180.2847 1182.7164 1204.9990 1228.1393 1245.1026 1285.7425 1287.8355 1291.0410 1309.6273 1315.4201 1343.9086 1383.1522 1404.5041 1407.8506 1435.0942 1478.7410 1592.7951 1612.5920 3008.0575 3023.4089 3072.4702 3074.6513 3075.4545 3127.8677 3136.3190 3147.9343 3156.2614 3168.1836 3172.0552 3172.7730
redmass: 7.1686 4.5373 4.7724 5.4762 8.4071 4.9984 5.0520 10.1680 3.3396 4.3671 5.5178 3.5910 6.4319 2.8696 6.5208 3.5937 5.5854 4.5826 5.5653 7.9368 6.1857 6.4848 2.6148 3.6804 1.8020 3.4934 2.3180 5.3333 12.4045 3.3111 3.2326 1.2596 4.1918 4.0958 2.4814 1.5668 3.4672 6.0742 1.3783 1.4948 3.6325 2.1911 1.9605 1.5595 3.6172 1.2481 1.3045 1.0533 1.1164 1.1493 2.6110 1.2864 1.2077 1.2282 1.2361 1.2705 1.2577 1.3118 1.4993 8.7674 1.1170 1.1164 2.1979 2.2829 6.3080 6.0657 1.0848 1.0860 1.0558 1.0580 1.0868 1.0849 1.0879 1.0923 1.0963 1.1015 1.1116 1.1123
irintensity: 4.5328 0.8626 0.0945 1.5593 2.2313 3.0399 0.1204 3.9399 10.4002 10.7231 3.5583 12.5288 29.2048 0.0409 16.0967 4.1639 1.7222 14.6086 6.7865 5.0969 14.3687 0.0003 21.9206 25.0188 56.8541 13.0008 1.0849 16.3789 124.2433 7.1737 2.6672 1.9223 17.6018 53.3190 4.9591 28.9996 62.8673 4.8208 0.0054 39.9973 142.7635 13.1739 1.2987 4.4370 32.2484 0.1793 9.5193 0.0007 0.4711 18.4498 49.5135 0.2163 0.2842 52.7437 9.1700 2.4577 1.4494 0.3798 7.6370 0.0377 23.7317 21.1531 12.3820 6.9648 0.5926 0.0967 4.2453 35.3565 0.2610 2.9237 10.7744 0.1430 4.2640 12.0246 21.6674 19.5322 2.0328 1.4522
temp: 298.150 k
press: 1.00000 atm
elementType: 16 8 8 8 8 6 6 6 6 6 6 6 6 6 6 6 1 1 1 1 1 1 1 1 1 1 1 1
symmnumber: 1
zpe: 555912.2 jmol-1
zpe.correction: 0.211736 hartree
zpe.thermalcorrener: 0.225925 hartree
zpe.thermalcorrenthalpy: 0.226869 hartree
zpe.thermalcorrgfe: 0.168522 hartree
zpe.sumelectzpe: -1123.952872 hartree
zpe.sumelectthermal: -1123.938683 hartree
zpe.sumelectthermalent: -1123.937739 hartree
zpe.sumelectthermalfe: -1123.996086 hartree
dipole: 7.0845 0.0176 -3.0803
dipole: 7.7252
quadrupole: -125.9321 -92.1958 -105.9667
quadrupole: -0.1280 -0.3168 0.0323
quadrupole: -17.9005 15.8357 2.0648 -0.1280 -0.3168 0.0323
hfenergy: -1124.1646078 hartree
pointgroup: C01 [X(C11H12O4S1)]
dipole: -2.7954327 -0.7877357 -0.8958373 debye
polarizability: 193.4748838|7.9296467|125.6949355|9.0996928|-11.892149|122.0383254 unknown
InChI: InChI=1S/C11H12O4S/c12-16(13)6-9-10(7-16)15-11(14-9)8-4-2-1-3-5-8/h1-5,9-11H,6-7H2
charge 0 multiplicity 1
28 atoms
S  3.679722 -0.106861 -0.057714
O  0.362151 1.401102 -0.074813
O  0.358906 -0.354045 1.445776
O  4.133675 0.926581 1.118685
O  4.795326 -0.89163 -0.96029
C  0.997959 0.288416 -0.812671
C  1.002726 -0.924602 0.242686
C  2.378741 0.730559 -1.260919
C  2.387869 -1.416782 0.621877
C  -0.457068 0.771557 0.969047
C  -1.82071 0.320579 0.446232
C  -2.466138 1.052593 -0.58052
C  -2.464762 -0.803503 1.019021
C  -3.744286 0.657611 -1.035488
C  -3.742899 -1.196271 0.562128
C  -4.385312 -0.467032 -0.465437
H  0.369545 0.002995 -1.6769
H  0.383365 -1.747303 -0.16077
H  2.682257 0.350531 -2.246691
H  2.536653 1.811676 -1.147057
H  2.547516 -1.439476 1.708461
H  2.696719 -2.344431 0.119483
H  -0.520308 1.49165 1.800516
H  -1.961614 1.921464 -1.017049
H  -1.959788 -1.36348 1.813709
H  -4.238584 1.225732 -1.831308
H  -4.236126 -2.067888 1.006412
H  -5.377038 -0.771342 -0.81801
