program: Gaussian 09
title: 000289361
version: EM64L-G09RevD.01
frameworkgroup: C1[X(C22H30N2O4)]
method: RPBEPBE
basis: SDD
operation: Freq
keyword: #p
keyword: freq=noraman
keyword: PBEPBE/SDD
title: #p freq=noraman PBEPBE/SDD
converged: YES YES NO NO
title: Mulliken charges:
elementType: O O O O N N C C C C C C C C C C C C C C C C C C C C C C H H H H H H H H H H H H H H H H H H H H H H H H H H H H H H
charge: -0.328987 -0.295672 -0.215156 -0.220875 -0.724069 0.013641 0.142538 0.299091 -0.412447 0.511435 -0.779794 -0.720107 -0.717792 -0.730086 -0.728572 -0.420211 -0.393493 -0.386969 -0.428871 0.402195 -0.255639 -0.351463 0.168219 0.404418 -0.295173 -0.556615 0.440169 -0.406974 0.190472 0.189644 0.213354 0.223332 0.213243 0.210897 0.223262 0.215680 0.203185 0.225361 0.218106 0.211301 0.211256 0.212667 0.205800 0.207731 0.231323 0.250562 0.230971 0.243547 0.231283 0.235512 0.210612 0.241541 0.222076 0.251934 0.277394 0.284051 0.304385 0.396773
chargesum: 0.00000
title: Mulliken charges with hydrogens summed into heavy atoms:
elementType: O O O O N N C C C C C C C C C C C C C C C C C C C C C C
charge: -0.328987 -0.295672 -0.215156 -0.220875 -0.022911 0.013641 0.142538 0.299091 -0.032331 0.511435 -0.129864 -0.070268 -0.071139 -0.094862 -0.083719 -0.169649 -0.162522 -0.143422 -0.197588 0.402195 0.190484 0.112155 0.168219 0.404418 -0.043239 -0.279220 0.440169 -0.122923
polarizability: 4.01127740e+02 2.00839333e+01 2.39914097e+02 -1.23424585e+01 3.93962717e+01 2.17525362e+02
1716.lowfreq: -6.7050 -3.0034 -0.0004 0.0005 0.0008 1.8580 8.8463 17.3339 25.6944
frequency: 8.3374 17.2016 25.6781 32.6460 34.1897 58.6619 61.3187 65.1918 85.4085 97.8217 112.2342 144.1422 176.0291 178.5570 194.7436 206.5555 213.5425 221.3609 227.4303 229.5511 241.4362 251.9968 265.8265 273.6750 281.5695 298.6536 303.9119 324.5680 336.5013 350.7310 356.2021 370.7594 381.7972 403.2362 407.4686 408.5442 416.1070 432.6840 434.0634 447.0127 477.4146 479.6840 507.2573 525.9262 542.9538 561.4292 567.6573 577.6351 628.2709 634.7756 672.0848 690.6947 702.1591 717.8648 732.1958 736.9668 749.9906 754.0467 779.3098 813.2378 825.4662 826.8846 827.9160 866.0720 866.7066 894.4647 897.1707 905.7678 919.0671 926.1525 934.5833 934.9478 938.3689 942.9232 956.5583 957.3238 974.7073 1000.4478 1004.9780 1011.2651 1022.9644 1031.5242 1037.8093 1048.2564 1086.7099 1095.6505 1105.3646 1117.7495 1120.8009 1134.2511 1161.8305 1176.7251 1185.2825 1194.5210 1209.6612 1216.2721 1217.1410 1223.9619 1249.0789 1249.4707 1256.6799 1262.0628 1299.5728 1309.9451 1326.9004 1340.3989 1359.5045 1364.1735 1366.3036 1372.2345 1376.1159 1378.3696 1385.0805 1394.6512 1404.3877 1412.0901 1414.1159 1448.7968 1450.9122 1457.2600 1458.6191 1462.7251 1463.3486 1465.2813 1466.5287 1470.6888 1478.0144 1481.0329 1486.4327 1495.7359 1500.0138 1501.8829 1504.8894 1576.7536 1583.6406 1620.4928 1623.4555 1669.9470 2953.8811 2962.4299 2970.7404 2970.9337 2971.0719 2976.8350 2979.3611 2991.1595 3009.3642 3038.1201 3054.2543 3059.4399 3059.9771 3062.4242 3065.6974 3068.9872 3069.3023 3076.3352 3082.0685 3084.2186 3095.5772 3125.3715 3145.3243 3154.2467 3160.9515 3166.5115 3166.7140 3198.1616 3432.0705 3652.6259
redmass: 4.9452 4.4964 5.1317 5.3410 3.0456 4.0097 7.2206 5.6641 6.0636 5.0301 4.7309 3.2708 4.0633 2.2969 2.4311 4.3424 1.5292 3.8073 3.1761 1.1146 1.3553 2.2436 1.3494 1.9866 1.9109 2.8405 4.0913 2.5530 2.1415 2.0377 2.2079 2.7636 2.8454 2.4804 4.4138 2.7473 2.6871 1.6444 1.8658 3.1054 2.8521 3.3211 2.6481 4.9114 3.3689 4.8199 4.9377 2.7560 5.7113 6.3145 4.2039 1.2370 4.4277 3.5495 3.4362 3.5251 3.6862 9.2410 3.7256 1.2825 2.3622 1.6507 1.6451 2.3448 2.8168 1.5751 3.2665 2.0633 1.6921 1.5227 1.5022 4.3397 1.3037 1.4255 1.3715 1.3436 1.7425 1.8496 1.8215 2.4390 1.4024 1.4085 2.6931 1.8908 1.6841 1.9918 1.9522 1.8989 1.4147 1.6972 1.7756 2.3699 1.5599 2.4711 1.3255 7.1119 3.0882 2.1915 2.6142 1.3234 3.3254 1.2985 2.7113 1.2952 1.5369 1.3293 1.4373 2.8558 11.5319 1.2201 1.2053 1.2069 1.6177 1.2326 1.2138 5.4631 3.2836 3.4728 1.0759 1.0536 1.1068 1.0503 1.0489 1.1727 1.0739 1.0562 1.0557 1.0563 1.0644 1.0743 2.1226 1.1129 3.7523 7.2195 7.0314 6.3394 5.5200 1.2111 1.0588 1.0355 1.0367 1.0515 1.0396 1.0372 1.0372 1.0592 1.0990 1.1061 1.0995 1.0994 1.1064 1.0995 1.0993 1.0990 1.0987 1.0996 1.0988 1.0990 1.0956 1.0878 1.0866 1.0955 1.0903 1.0917 1.0952 1.0953 1.0575 1.0940
irintensity: 0.3266 0.2387 0.4661 0.7634 0.3041 0.0785 0.4220 0.2499 2.0685 0.8357 0.8868 0.7529 4.3390 1.3421 2.2998 5.8161 0.6329 4.8213 0.3762 0.3684 0.0661 3.1067 0.1727 0.3668 0.2237 0.7816 5.5559 0.3309 2.2674 1.9637 0.1098 5.4702 2.3557 1.5089 6.9056 1.2795 0.2823 62.1533 41.9384 4.5943 0.1232 0.3189 5.2662 1.9935 10.4699 2.2826 6.5967 12.1005 6.2355 5.6777 22.4118 131.0890 8.5607 7.7950 2.3370 3.7888 10.0990 23.3560 17.4531 2.8901 6.7679 21.0507 69.2337 13.0896 41.8290 59.3415 68.5006 1.4742 5.9474 2.6345 3.7853 17.8794 0.8633 0.9922 0.0150 0.4732 9.1715 4.9536 22.3484 18.3861 0.4578 0.3837 44.6321 14.3745 14.3965 3.4223 19.2044 20.5320 60.0848 8.1183 1.2039 379.6161 90.0558 24.2303 89.5664 337.8568 7.2004 99.1298 17.3948 9.4477 35.3217 2.6221 124.2440 1.1600 12.0598 6.7771 10.6665 2.7979 104.8345 2.7625 33.3926 18.0488 10.5642 17.9544 13.0273 19.8896 9.5094 24.0284 4.0613 3.1487 41.7200 1.1064 1.2778 21.9875 3.6897 8.0327 18.3960 10.9071 21.2141 16.0517 317.4176 15.7099 100.9167 35.9526 11.0550 52.9937 27.6706 183.6517 25.4362 39.8949 36.5284 28.7037 42.8804 20.8068 26.8752 55.1581 29.3555 29.1878 6.4838 52.5848 21.0519 5.2020 13.7308 31.1823 156.6396 42.7691 37.9519 38.3495 37.8454 19.8597 15.9423 16.8970 5.0701 5.6201 7.6586 3.4515 657.9838 65.2961
temp: 298.150 k
press: 1.00000 atm
elementType: 8 8 8 8 7 7 6 6 6 6 6 6 6 6 6 6 6 6 6 6 6 6 6 6 6 6 6 6 1 1 1 1 1 1 1 1 1 1 1 1 1 1 1 1 1 1 1 1 1 1 1 1 1 1 1 1 1 1
symmnumber: 1
zpe: 1262173.3 jmol-1
zpe.correction: 0.480736 hartree
zpe.thermalcorrener: 0.509737 hartree
zpe.thermalcorrenthalpy: 0.510681 hartree
zpe.thermalcorrgfe: 0.418768 hartree
zpe.sumelectzpe: -1264.523605 hartree
zpe.sumelectthermal: -1264.494605 hartree
zpe.sumelectthermalent: -1264.493661 hartree
zpe.sumelectthermalfe: -1264.585573 hartree
dipole: -8.2354 -4.6648 0.0845
dipole: 9.4651
quadrupole: -230.7450 -161.0479 -167.9576
quadrupole: -25.6993 -7.1368 5.7484
quadrupole: -44.1614 25.5356 18.6259 -25.6993 -7.1368 5.7484
hfenergy: -1265.0043416 hartree
pointgroup: C01 [X(C22H30N2O4)]
dipole: 3.3151273 -1.6952284 0.0576247 debye
polarizability: 402.5714051|-13.623676|234.398152|-9.7169112|-40.7631209|221.5976422 unknown
InChI: InChI=1S/C22H30N2O4/c1-21(2,3)15-22(4,5)16-6-9-18(10-7-16)27-12-13-28-20-11-8-17(24(25)26)14-19(20)23/h6-11,14H,12-13,15,23H2,1-5H3
charge 0 multiplicity 1
58 atoms
O  -0.303105 -1.436057 -0.24828
O  -2.781902 -1.3963 1.364354
O  -8.587474 1.059326 0.29153
O  -7.439876 1.930421 -1.475008
N  -2.706453 0.214449 -0.960389
N  -7.506638 1.210317 -0.401788
C  5.346839 -0.115361 -0.736111
C  5.548722 2.120564 0.887788
C  5.604784 1.424406 -0.520483
C  3.855371 -0.48933 -0.55141
C  6.279563 -0.987321 0.142876
C  5.718216 -0.413458 -2.227668
C  4.320703 1.696904 1.734722
C  5.444622 3.6503 0.610274
C  6.850558 1.884957 1.705282
C  3.425771 -1.548719 0.28238
C  2.845334 0.206621 -1.275853
C  2.061355 -1.900077 0.415984
C  1.483681 -0.122298 -1.15937
C  1.086045 -1.177405 -0.304977
C  -0.75964 -2.523009 0.633035
C  -2.277864 -2.550893 0.574092
C  -3.964843 -0.780243 0.890856
C  -3.901841 0.052571 -0.280507
C  -5.155106 -0.922483 1.627282
C  -5.097719 0.69791 -0.693079
C  -6.278633 0.521108 0.056182
C  -6.338319 -0.271714 1.224141
H  6.610182 1.63816 -0.942218
H  4.890519 1.964559 -1.174864
H  6.027972 -0.93387 1.2163
H  7.325816 -0.652866 0.025856
H  6.231693 -2.048615 -0.165914
H  6.793264 -0.219769 -2.402165
H  5.509482 -1.46956 -2.478913
H  5.141342 0.221266 -2.924545
H  4.275391 2.303683 2.659494
H  3.376391 1.846015 1.180737
H  4.366525 0.634171 2.030363
H  4.492666 3.898832 0.103748
H  6.275127 3.997018 -0.034622
H  5.487065 4.22345 1.555594
H  7.74123 2.206776 1.131747
H  6.822518 2.474299 2.641896
H  6.989612 0.827294 1.982559
H  4.158091 -2.125416 0.854995
H  3.121211 1.026356 -1.948672
H  1.78637 -2.725192 1.07983
H  0.722415 0.426274 -1.723667
H  -0.428744 -2.333466 1.673042
H  -0.343224 -3.489412 0.282263
H  -2.633612 -2.498064 -0.472001
H  -2.654156 -3.482123 1.040349
H  -5.134036 -1.548436 2.524793
H  -5.120483 1.346011 -1.574071
H  -7.275944 -0.367447 1.774536
H  -2.673422 0.800574 -1.789953
H  -1.835315 -0.206184 -0.619059
