program: Gaussian 09
title: 000289309
version: EM64L-G09RevD.01
frameworkgroup: C1[X(C18H24O)]
method: RPBEPBE
basis: SDD
operation: Freq
keyword: #pfreq=noraman
keyword: PBEPBE/SDD
title: #p freq=noraman PBEPBE/SDD
converged: YES YES NO NO
title: Mulliken charges:
elementType: O C C C C C C C C C C C C C C C C C C H H H H H H H H H H H H H H H H H H H H H H H H
charge: -0.235721 -0.357622 -0.352571 -0.375859 -0.356226 -0.542201 -0.696498 0.171497 -0.306295 -0.266987 0.350769 -0.389565 0.430583 -0.830855 -0.375098 -0.396481 -0.244601 -0.242404 -0.238463 0.182819 0.182582 0.189693 0.189596 0.213772 0.216342 0.193362 0.193201 0.230261 0.232079 0.214291 0.210449 0.210343 0.227392 0.257552 0.221373 0.232742 0.246845 0.235910 0.251653 0.232032 0.228263 0.229667 0.232378
chargesum: 0.00000
title: Mulliken charges with hydrogens summed into heavy atoms:
elementType: O C C C C C C C C C C C C C C C C C C
charge: -0.235721 0.007778 0.026718 0.054255 0.030337 -0.079861 -0.061415 0.171497 -0.078903 -0.009435 0.350769 -0.168192 0.430583 -0.115358 -0.123445 -0.164449 -0.016337 -0.012736 -0.006086
polarizability: 3.93561275e+02 4.82774745e+01 2.01054063e+02 -1.33962374e+01 1.07911158e+01 1.25161604e+02
1716.lowfreq: -25.5965 -3.2543 -0.0010 -0.0006 0.0008 3.2662 10.0901 15.5076 26.5079
frequency: -22.6801 15.4443 26.4848 33.8012 49.5125 62.8431 66.0934 84.9753 105.4244 127.2148 134.4283 148.9515 160.6670 184.9247 199.1286 224.4193 231.6077 234.6934 296.7005 306.6396 343.9100 407.2851 415.4810 439.2093 449.6750 475.8087 515.4804 531.4756 552.2280 614.9917 636.2526 697.7920 700.9788 715.8868 731.4322 758.5793 784.4207 807.1914 846.8026 849.3172 875.2734 881.4263 890.6789 896.8615 929.1617 948.3700 976.7987 977.6473 987.0503 991.2986 996.4298 1003.1895 1011.5969 1028.3819 1031.9287 1038.4826 1071.6707 1083.3438 1086.7903 1092.2197 1095.8256 1131.8057 1173.2129 1186.0096 1189.6889 1194.7047 1227.7991 1237.1024 1253.4645 1271.2946 1275.7891 1285.7732 1292.3108 1292.6855 1302.2370 1325.3304 1335.9841 1354.0098 1357.6845 1368.8325 1388.5415 1391.4822 1398.8779 1428.3783 1437.1370 1459.3897 1462.5737 1470.3192 1471.5146 1477.4095 1479.4538 1480.8719 1482.7661 1487.0163 1546.5311 1575.3866 1600.1715 1610.2346 1635.9690 2944.7883 2947.8008 2955.4519 2965.9113 2971.3213 2971.5913 2984.8768 2988.7218 2991.6485 3001.9736 3028.6439 3053.4269 3054.0695 3068.5340 3069.7939 3085.1030 3088.7762 3090.2593 3112.5944 3120.0342 3130.4994 3144.1245 3162.0759 3181.1900
redmass: 1.5841 3.8574 4.7364 3.3512 5.0140 3.2019 3.1971 2.3278 2.2011 3.2276 2.4598 3.2615 3.5806 2.3267 2.4388 1.7250 1.1143 5.6928 3.2668 2.9209 3.7093 2.9627 3.3190 3.5411 3.8439 3.0139 2.3701 3.3203 2.3764 6.3387 5.9502 2.0570 3.1769 1.0967 1.1383 1.8268 1.3086 3.6023 1.3494 1.4530 2.9619 1.4200 1.7748 1.8488 1.6080 3.0799 1.2570 1.4143 3.8170 1.4845 1.3183 1.7096 2.7019 2.4255 2.3564 1.5547 2.6123 2.1874 1.6683 1.4127 1.8370 2.6299 1.0970 1.7718 1.6693 1.1176 1.3448 1.3284 2.2133 1.4959 1.1185 1.0942 1.1093 1.5482 1.4354 1.5012 1.5731 1.6391 1.7422 2.6521 1.2174 2.0192 1.4563 1.1024 2.2543 1.0722 1.0725 1.0761 1.0802 1.0423 1.0785 1.0657 2.2285 1.0841 6.9142 5.5792 5.9906 5.9722 5.6886 1.0598 1.0592 1.0588 1.0590 1.0396 1.0363 1.0972 1.0966 1.0608 1.1015 1.1042 1.0936 1.1031 1.1006 1.0993 1.0933 1.0899 1.0930 1.0900 1.0868 1.0873 1.0935 1.0987 1.0952
irintensity: 0.1739 0.2485 0.0792 0.1503 3.9087 0.1000 0.5914 0.7843 0.8731 0.2788 0.0703 0.1573 0.9361 2.2912 3.8126 0.4093 0.0094 3.6409 0.8744 0.1424 3.4217 2.6928 3.8070 6.9094 9.8642 0.8091 15.0335 4.1865 2.3113 0.2104 1.8748 34.8584 24.4236 12.4399 0.8478 42.9645 1.7656 2.7633 6.0306 7.7676 16.9652 11.5248 7.1008 4.1527 9.3659 3.3305 7.2223 2.4206 11.7374 56.3479 1.1196 61.8112 1.9194 4.0910 19.9546 7.5087 0.1796 7.9107 9.0173 0.0714 59.0041 94.1688 1.1364 12.0467 0.1169 3.4191 19.0053 0.0359 3.5163 15.1218 0.0942 0.0220 4.8733 74.2486 7.7299 0.0329 43.7002 6.5786 3.9514 74.6586 10.9496 22.7812 39.0755 19.5892 17.0956 0.5242 0.7131 2.8401 4.6939 12.2634 4.0072 19.6933 14.1018 20.0973 568.2142 2.9490 24.4978 17.8230 63.2750 17.9625 27.3186 6.7298 89.6671 22.9393 39.0399 6.4213 7.3698 31.3108 0.5359 37.8724 18.4861 69.9144 96.7831 56.4270 2.5375 10.3614 20.5565 14.5589 7.5988 0.2163 26.3287 42.1435 12.5328
temp: 298.150 k
press: 1.00000 atm
elementType: 8 6 6 6 6 6 6 6 6 6 6 6 6 6 6 6 6 6 6 1 1 1 1 1 1 1 1 1 1 1 1 1 1 1 1 1 1 1 1 1 1 1 1
symmnumber: 1
zpe: 964881.2 jmol-1
zpe.correction: 0.367504 hartree
zpe.thermalcorrener: 0.387713 hartree
zpe.thermalcorrenthalpy: 0.388658 hartree
zpe.thermalcorrgfe: 0.315383 hartree
zpe.sumelectzpe: -774.084997 hartree
zpe.sumelectthermal: -774.064788 hartree
zpe.sumelectthermalent: -774.063844 hartree
zpe.sumelectthermalfe: -774.137118 hartree
dipole: -2.9587 -2.5562 1.0093
dipole: 4.0382
quadrupole: -102.1575 -116.0049 -117.9462
quadrupole: -5.8912 -0.8638 6.2704
quadrupole: 9.8787 -3.9687 -5.9100 -5.8912 -0.8638 6.2704
hfenergy: -774.4525013 hartree
pointgroup: C01 [X(C18H24O1)]
dipole: -1.1683102 -0.1579517 -1.0649839 debye
polarizability: 393.515121|-3.5663526|132.340482|49.3744981|-26.0492349|193.9213398 unknown
InChI: InChI=1S/C18H24O/c1-3-4-5-9-12-18(19)14-13-16(2)15-17-10-7-6-8-11-17/h6-8,10-11,13-15H,3-5,9,12H2,1-2H3
charge 0 multiplicity 1
43 atoms
O  2.192933 0.297262 2.351134
C  5.372947 0.01159 -0.652604
C  6.838198 0.108101 -0.171001
C  4.350954 0.16405 0.495392
C  7.870635 -0.058787 -1.309168
C  2.893669 0.067845 0.012749
C  9.331032 0.036506 -0.81676
C  1.852796 0.168216 1.133363
C  0.428996 0.095611 0.710442
C  -0.594486 0.149783 1.626731
C  -2.040935 0.102096 1.372056
C  -2.543893 0.473725 0.136643
C  -3.922575 0.470865 -0.370776
C  -2.900536 -0.309928 2.559046
C  -4.976676 -0.346805 0.141941
C  -4.221958 1.311929 -1.487557
C  -6.269007 -0.298688 -0.420397
C  -5.514722 1.365401 -2.043008
C  -6.549807 0.561569 -1.507757
H  5.189845 0.791637 -1.422028
H  5.219568 -0.965268 -1.15871
H  6.997125 1.087422 0.326905
H  7.020231 -0.665604 0.603995
H  4.500593 1.133217 1.009342
H  4.528453 -0.611021 1.265562
H  7.709629 -1.037707 -1.805778
H  7.688907 0.715274 -2.082978
H  2.675237 0.860956 -0.734828
H  2.724423 -0.890396 -0.525259
H  10.04925 -0.085779 -1.648488
H  9.547033 -0.746274 -0.065155
H  9.525855 1.017224 -0.34292
H  0.231856 -0.033208 -0.362318
H  -0.277609 0.204968 2.68003
H  -1.812094 0.884982 -0.574326
H  -3.071754 -1.4044 2.57908
H  -3.886194 0.185399 2.551718
H  -2.391485 -0.051147 3.504446
H  -4.777105 -1.051575 0.952559
H  -3.423789 1.935542 -1.909307
H  -7.058596 -0.942118 -0.016131
H  -5.71697 2.026777 -2.892712
H  -7.55608 0.596357 -1.939465
