program: Gaussian 09
title: 000289282
version: EM64L-G09RevD.01
frameworkgroup: C1[X(C15H20N2O3)]
method: RPBEPBE
basis: SDD
operation: Freq
keyword: #p
keyword: freq=noraman
keyword: PBEPBE/SDD
title: #p freq=noraman PBEPBE/SDD
converged: YES YES NO NO
title: Mulliken charges:
elementType: O O O N N C C C C C C C C C C C C C C C H H H H H H H H H H H H H H H H H H H H
charge: -0.286097 -0.251727 -0.277829 -0.413710 -0.384477 -0.128317 -0.432977 -0.476075 0.253051 -0.053555 0.228029 -0.425734 -0.720995 -0.385669 -0.278711 -0.207759 0.213015 -0.609385 0.287621 -0.503734 0.246407 0.210049 0.196949 0.281276 0.195346 0.263439 0.278254 0.224178 0.221012 0.207751 0.232800 0.346439 0.223247 0.217865 0.216280 0.277294 0.283463 0.240879 0.246038 0.246067
chargesum: 0.00000
title: Mulliken charges with hydrogens summed into heavy atoms:
elementType: O O O N N C C C C C C C C C C C C C C C
charge: -0.286097 -0.251727 -0.277829 -0.135456 -0.038038 0.118090 -0.025978 0.000548 0.253051 0.209884 0.228029 -0.201556 -0.059432 -0.162422 -0.060846 0.008521 0.213015 -0.048628 0.287621 0.229250
polarizability: 2.26737218e+02 1.15683675e+01 1.60787182e+02 -4.13159371e+00 2.33226867e+01 1.63785362e+02
1716.lowfreq: -3.7880 -2.6237 -0.0007 -0.0006 -0.0005 8.1686 13.7069 27.3431 34.3266
frequency: 13.1427 27.2888 34.2746 39.2890 69.3650 77.6476 83.2085 86.9234 104.5793 139.4894 175.1958 180.9182 204.1287 210.7795 222.4458 249.7029 263.7319 316.8237 349.7593 364.4971 398.1201 411.6039 419.2489 433.4399 463.0845 477.2432 516.6081 534.5327 555.7031 604.6256 614.3605 638.0503 673.3603 695.7606 726.7228 745.6048 772.7242 779.0839 837.3823 843.1343 853.9569 855.8676 872.2831 894.4617 920.5435 944.3674 946.3830 959.0334 962.7323 984.5553 1001.9575 1017.3994 1038.4836 1067.5047 1095.4453 1112.4991 1117.8526 1128.7249 1131.1956 1150.0093 1155.5664 1163.7487 1168.9229 1191.3050 1197.0772 1215.4640 1252.8436 1257.6119 1268.7178 1270.7486 1293.7995 1304.9456 1314.7166 1325.2415 1344.8404 1356.2104 1374.6503 1387.6090 1421.9896 1423.3089 1426.1132 1452.8911 1453.3598 1461.5008 1461.6831 1472.1219 1473.1948 1480.2599 1505.3228 1522.7145 1601.6967 1602.2941 1625.3053 1632.2512 2899.1918 2953.7801 2969.0372 2977.9617 2996.9220 3010.3606 3022.6215 3038.6247 3073.4385 3074.8037 3091.0665 3106.5214 3114.5074 3115.9133 3122.5780 3139.7568 3157.4014 3159.7028 3394.4503 3582.6632
redmass: 4.3067 4.6233 3.9403 4.0159 1.4052 3.7622 4.2271 3.4063 4.3243 2.6312 3.4017 3.6596 2.9391 1.3859 2.4775 3.8368 3.9026 3.5822 4.4078 4.8821 1.7339 1.8373 2.9242 2.9695 3.1641 2.6138 3.2439 5.0974 3.4860 5.3290 5.1403 4.2020 4.0288 5.1443 2.4017 1.6182 1.1382 3.4218 1.8463 2.0380 2.5650 4.3708 2.2473 2.6844 1.3881 2.4940 2.9095 1.3041 2.2194 2.5072 2.0096 2.1624 2.8769 3.2800 2.1079 1.2707 2.1055 2.1892 2.2346 1.4568 2.2541 1.3098 1.4288 1.4287 1.3618 1.3505 2.0709 1.3434 1.5729 1.8100 1.3250 1.3427 1.8193 1.4739 1.4738 1.3478 2.5184 1.2211 1.1173 1.1827 2.3872 1.0512 1.1182 1.0776 2.2475 1.0531 1.0628 2.1857 1.4020 1.8032 7.7356 6.8770 6.9712 6.0756 1.0716 1.0814 1.0600 1.0382 1.0680 1.0295 1.0894 1.0959 1.0928 1.0977 1.1001 1.0912 1.1049 1.0856 1.0886 1.0938 1.1052 1.0998 1.0800 1.0784
irintensity: 0.6064 0.8584 0.6683 0.6542 2.4196 1.3432 9.1561 0.4385 2.0569 7.7656 8.5746 2.6082 6.6506 3.0486 4.6899 10.3317 7.1115 24.3771 10.8955 1.8718 110.8680 50.7258 2.3741 5.7381 0.5183 7.4911 16.0384 3.2237 5.0502 1.9394 1.4314 9.1482 8.9301 10.9884 20.6310 77.9027 117.3972 2.2377 2.9838 2.5624 7.0276 6.9758 9.3103 3.5207 1.9503 30.1887 8.4744 0.1578 7.3090 3.0484 4.1495 8.9593 21.3471 4.1123 8.5547 0.4553 22.4885 12.2365 266.1665 24.0453 6.4965 5.0480 1.5302 20.0362 26.6369 11.4415 95.6477 8.6596 14.8113 32.8759 18.7186 5.8038 162.7418 21.0622 9.3399 0.4737 29.6436 18.1083 49.3891 17.4190 3.5345 18.5846 7.9392 20.4803 14.8629 15.8524 21.7557 62.3535 30.7493 312.4301 49.5275 25.1126 33.2057 312.7895 97.5911 23.0456 18.1931 33.6618 0.5508 28.2180 5.9889 24.1239 8.1846 41.8431 36.9569 0.8905 22.6704 8.3166 10.9857 38.1056 14.3876 31.6720 179.8063 21.3825
temp: 298.150 k
press: 1.00000 atm
elementType: 8 8 8 7 7 6 6 6 6 6 6 6 6 6 6 6 6 6 6 6 1 1 1 1 1 1 1 1 1 1 1 1 1 1 1 1 1 1 1 1
symmnumber: 1
zpe: 862927.2 jmol-1
zpe.correction: 0.328672 hartree
zpe.thermalcorrener: 0.348954 hartree
zpe.thermalcorrenthalpy: 0.349898 hartree
zpe.thermalcorrgfe: 0.276689 hartree
zpe.sumelectzpe: -917.291366 hartree
zpe.sumelectthermal: -917.271084 hartree
zpe.sumelectthermalent: -917.270140 hartree
zpe.sumelectthermalfe: -917.343349 hartree
dipole: -3.3655 0.6075 1.3183
dipole: 3.6652
quadrupole: -97.7865 -117.6347 -119.7997
quadrupole: -14.6183 -5.5611 -2.7976
quadrupole: 13.9538 -5.8944 -8.0594 -14.6183 -5.5611 -2.7976
hfenergy: -917.6200373 hartree
pointgroup: C01 [X(C15H20N2O3)]
dipole: -1.3178626 -0.0426228 -0.583791 debye
polarizability: 227.6012018|-9.0094647|142.288306|-1.3748543|13.2272344|181.4202552 unknown
InChI: InChI=1S/C15H20N2O3/c1-10(17-14(18)8-15(19)20-2)7-11-9-16-13-6-4-3-5-12(11)13/h3-6,10-11,16-17H,7-9H2,1-2H3
charge 0 multiplicity 1
40 atoms
O  -1.569375 0.840933 2.10633
O  -5.179367 -1.568367 0.342443
O  -3.668094 -0.884431 -1.280779
N  3.005459 0.338688 1.882463
N  -1.634041 0.713999 -0.228393
C  1.392349 0.31107 0.109283
C  0.717294 1.230927 -0.928332
C  1.760118 1.026477 1.454254
C  2.734667 -0.283396 -0.329578
C  -0.657987 1.798979 -0.479959
C  3.633588 -0.25432 0.778491
C  3.132395 -0.854141 -1.546041
C  -1.230049 2.77916 -1.525834
C  4.934697 -0.797349 0.674528
C  4.441499 -1.398738 -1.669183
C  5.323519 -1.367959 -0.563901
C  -2.024383 0.334985 1.031515
C  -3.045855 -0.823377 1.124654
C  -3.951957 -1.069915 -0.067011
C  -6.143012 -1.901031 -0.74039
H  0.696139 -0.523422 0.338169
H  1.390586 2.081825 -1.153092
H  0.578175 0.677222 -1.879646
H  0.957594 0.937171 2.203678
H  1.947557 2.109673 1.265335
H  -0.534428 2.321782 0.486292
H  3.529442 0.660222 2.694862
H  2.445606 -0.883481 -2.401051
H  -0.526973 3.614447 -1.693017
H  -1.392844 2.276169 -2.498539
H  -2.193621 3.198543 -1.187517
H  -2.089517 0.248804 -1.027787
H  5.628846 -0.780343 1.522457
H  4.765285 -1.841183 -2.617253
H  6.330938 -1.789551 -0.663381
H  -2.464346 -1.750744 1.304232
H  -3.653192 -0.66204 2.028276
H  -7.023917 -2.294612 -0.215693
H  -6.391921 -0.994772 -1.316573
H  -5.708174 -2.655602 -1.416504
