program: Gaussian 09
title: 000289344
version: EM64L-G09RevD.01
frameworkgroup: C1[X(C19H23NO2S)]
method: RPBEPBE
basis: SDD
operation: Freq
keyword: #p
keyword: freq=noraman
keyword: PBEPBE/SDD
title: #p freq=noraman PBEPBE/SDD
converged: YES YES NO NO
title: Mulliken charges:
elementType: S O O N C C C C C C C C C C C C C C C C C C C H H H H H H H H H H H H H H H H H H H H H H H
charge: 0.174892 -0.294547 -0.260409 -0.093083 -0.131252 -0.755840 0.518513 -0.643645 -0.307503 -0.436403 -0.371558 -0.615992 -0.614579 -0.220105 -0.232843 0.228064 -0.238339 0.215838 -0.340600 -0.334384 -0.220628 -0.218277 -0.223028 0.262323 0.266276 0.273069 0.254234 0.260523 0.228663 0.193681 0.240838 0.243081 0.221921 0.189413 0.231171 0.221196 0.190396 0.225646 0.228192 0.226115 0.230062 0.269342 0.265468 0.232456 0.230228 0.231416
chargesum: 0.00000
title: Mulliken charges with hydrogens summed into heavy atoms:
elementType: S O O N C C C C C C C C C C C C C C C C C C C
charge: 0.174892 -0.294547 -0.260409 -0.093083 0.131071 -0.216494 0.518513 -0.128888 0.114841 -0.195564 -0.128477 0.026513 0.022658 0.008087 -0.006729 0.228064 -0.008277 0.215838 -0.071258 -0.068916 0.011828 0.011950 0.008388
polarizability: 2.45155426e+02 7.68200730e+00 2.58183499e+02 2.38140134e+01 7.70721368e+00 2.08051128e+02
1716.lowfreq: -7.9778 -3.9719 -0.0008 -0.0001 0.0011 3.0514 7.8624 15.2185 19.3020
frequency: 6.3466 14.9291 18.9655 20.2885 26.3734 32.4505 54.4717 68.0515 76.4567 83.9189 91.6616 136.6615 150.4780 172.5305 189.5047 214.6942 236.5890 242.5091 258.7786 273.3854 293.6932 304.5661 355.5240 373.5855 401.2913 402.9852 416.7816 426.2207 434.2969 441.3302 502.3293 536.0008 606.0555 613.9061 616.2757 659.8676 678.3768 695.1333 699.0727 700.7402 707.4606 775.9447 778.3447 782.9879 795.2122 809.3781 818.6813 851.3841 857.3316 863.6700 919.8349 942.1791 953.3232 975.7871 988.1516 990.2877 990.8895 995.0077 996.6742 1007.5053 1018.2701 1020.2225 1026.0866 1033.8498 1049.6249 1059.4987 1071.1154 1083.2120 1086.5212 1090.9905 1116.0732 1145.8943 1172.9365 1173.5419 1180.4918 1183.2977 1188.5615 1214.4317 1223.0437 1234.1431 1245.4524 1258.3944 1265.4610 1296.0918 1302.2467 1314.3153 1317.7331 1347.5020 1367.7556 1388.8742 1389.8073 1420.1218 1423.9325 1437.8670 1441.5887 1444.4839 1452.3096 1462.2681 1467.7283 1475.4323 1477.5479 1480.8025 1482.9126 1486.1617 1584.8249 1595.3572 1611.3240 1613.1387 1621.8606 2851.6324 2853.8227 2870.5323 3018.8093 3020.9350 3027.0814 3028.1443 3040.3806 3041.8464 3079.2729 3084.3504 3097.0592 3102.6056 3123.4466 3127.7001 3128.9871 3138.9075 3141.9025 3149.7234 3154.9171 3165.2710 3166.9263 3179.7442
redmass: 5.1609 4.7009 3.8201 4.6665 2.8840 4.4097 5.8653 3.7160 5.4121 2.3160 4.2411 3.4708 5.7902 4.6134 4.7043 1.0904 1.3896 3.2961 4.9923 2.4235 4.6079 6.5435 2.5012 4.9177 2.7944 2.8208 2.6316 5.8748 2.4135 3.7381 3.5872 4.2409 5.9710 6.4416 6.4299 7.0443 5.0879 5.0748 2.3518 1.9436 2.0767 2.1567 3.1125 1.1982 2.1803 5.5526 3.8781 1.2918 3.7941 1.2466 1.4720 2.6424 1.4296 1.3983 1.3716 5.6028 5.5844 1.3983 1.3560 1.3289 3.0635 2.5395 2.2350 1.5492 2.9974 2.6699 2.5551 1.6040 1.7170 1.3399 1.3187 1.5566 1.0711 1.0570 1.1654 1.2351 1.1581 2.0608 1.5091 1.6832 2.1397 1.5534 2.1092 1.4880 1.2748 1.3359 1.3073 1.3676 1.3400 5.3949 10.0803 1.1393 1.0888 2.2429 1.1580 2.0561 1.1018 1.0511 1.0575 1.0533 2.2915 1.0889 2.3039 1.0534 6.8670 6.0666 6.1574 6.1202 10.2517 1.0571 1.0654 1.0616 1.0577 1.0729 1.0716 1.0597 1.0846 1.0882 1.1011 1.1005 1.1076 1.1055 1.0848 1.0879 1.0854 1.0921 1.0892 1.0965 1.0940 1.1016 1.0980 1.0972
irintensity: 0.2170 0.7128 0.0607 0.4236 0.2001 0.3757 1.1051 1.0899 1.0701 1.7940 0.3968 1.6192 0.3176 0.4497 0.0166 1.0720 0.3448 1.1490 7.1781 2.3107 1.1314 3.8024 10.0048 6.6676 0.3924 0.0173 1.3807 5.9833 1.5181 0.1898 15.0215 15.5202 20.0301 0.7831 0.0115 4.4860 19.4123 9.5662 40.0387 50.5791 99.8748 22.0018 2.7713 10.6800 23.0155 5.6149 23.6803 0.7807 11.3830 0.0585 10.4531 61.0870 4.7561 0.8396 2.2599 3.2180 0.1258 0.1577 0.8016 0.4312 144.9983 24.7120 3.1277 18.3367 235.3911 14.1637 20.5219 11.6609 26.9044 7.6463 16.6589 4.5552 0.8267 0.2749 41.3663 13.7990 0.3128 11.3832 49.6363 80.6275 227.9703 9.1423 3.9342 0.2313 8.6397 9.1627 20.0168 0.2756 1.7219 1.1379 2.6537 3.7135 9.0723 15.8096 3.6114 9.7635 4.7589 12.5409 6.2872 18.6623 5.4929 18.4917 9.5514 9.1946 35.7444 2.4931 10.8735 1.5023 125.5499 70.9377 68.8087 223.5301 9.5096 35.6348 60.8764 19.5928 11.1077 8.7147 18.8019 55.8796 35.1392 5.5042 3.7118 0.0040 0.2297 16.5824 11.9856 33.4815 18.2772 24.4934 22.7992 7.6275
temp: 298.150 k
press: 1.00000 atm
elementType: 16 8 8 7 6 6 6 6 6 6 6 6 6 6 6 6 6 6 6 6 6 6 6 1 1 1 1 1 1 1 1 1 1 1 1 1 1 1 1 1 1 1 1 1 1 1
symmnumber: 1
zpe: 985520.8 jmol-1
zpe.correction: 0.375365 hartree
zpe.thermalcorrener: 0.399105 hartree
zpe.thermalcorrenthalpy: 0.400049 hartree
zpe.thermalcorrgfe: 0.314955 hartree
zpe.sumelectzpe: -1339.363569 hartree
zpe.sumelectthermal: -1339.339829 hartree
zpe.sumelectthermalent: -1339.338885 hartree
zpe.sumelectthermalfe: -1339.423979 hartree
dipole: 0.2130 0.5159 -1.1342
dipole: 1.2641
quadrupole: -124.7211 -128.5793 -143.9790
quadrupole: 3.0190 6.2063 -1.1990
quadrupole: 7.7053 3.8472 -11.5525 3.0190 6.2063 -1.1990
hfenergy: -1339.7389341 hartree
pointgroup: C01 [X(C19H23N1O2S1)]
dipole: -0.0757327 -0.1576794 -0.465537 debye
polarizability: 243.2713421|9.062276|260.7735644|-22.8898056|-3.7598874|207.3451469 unknown
InChI: InChI=1S/C19H23NO2S/c1-20(2)13-14-23-15-18(16-9-5-3-6-10-16)22-19(21)17-11-7-4-8-12-17/h3-12,18H,13-15H2,1-2H3
charge 0 multiplicity 1
46 atoms
S  -2.251447 0.559893 -1.7540
O  0.743218 0.241461 -0.64238
O  0.706667 0.517776 1.677348
N  -5.722752 0.452525 0.543088
C  -0.153549 -0.951712 -0.50762
C  -1.074468 -0.91547 -1.736784
C  0.688028 -2.21897 -0.438812
C  -3.625982 -0.161139 -0.6563
C  -4.577377 0.975038 -0.240962
C  0.503288 -3.137453 0.622749
C  1.646001 -2.506878 -1.444987
C  -6.287916 1.453224 1.471998
C  -6.767807 -0.167528 -0.297003
C  1.252498 -4.334939 0.672321
C  2.398738 -3.699291 -1.393423
C  1.103534 0.89059 0.545362
C  2.200545 -4.619811 -0.336857
C  1.997099 2.058209 0.291864
C  2.477903 2.78291 1.41344
C  2.366889 2.4554 -1.019326
C  3.324143 3.894486 1.225186
C  3.213224 3.569155 -1.202725
C  3.693657 4.289498 -0.083108
H  -0.734318 -0.833782 0.425041
H  -1.677082 -1.83882 -1.782036
H  -0.48212 -0.842593 -2.664136
H  -4.145637 -0.945168 -1.232908
H  -3.170708 -0.609141 0.242534
H  -4.015033 1.685924 0.391306
H  -4.913207 1.540185 -1.147826
H  -0.215974 -2.907906 1.417939
H  1.815981 -1.786836 -2.253747
H  -7.06944 0.978485 2.092489
H  -6.748633 2.333556 0.955558
H  -5.497344 1.825426 2.146938
H  -6.334649 -0.962606 -0.927777
H  -7.280045 0.566709 -0.970414
H  -7.53387 -0.632402 0.348984
H  1.104446 -5.03735 1.500065
H  3.141071 -3.911252 -2.171134
H  2.785501 -5.545537 -0.296822
H  2.176572 2.458299 2.414877
H  1.984526 1.893037 -1.875326
H  3.695293 4.452059 2.091867
H  3.497237 3.877606 -2.214745
H  4.350999 5.154133 -0.229097
