program: Gaussian 09
title: 000289256
version: EM64L-G09RevD.01
frameworkgroup: C1[X(C11H21N)]
method: RPBEPBE
basis: SDD
operation: Freq
keyword: #pfreq=noraman
keyword: PBEPBE/SDD
title: #p freq=noraman PBEPBE/SDD
converged: YES YES NO NO
title: Mulliken charges:
elementType: N C C C C C C C C C C C H H H H H H H H H H H H H H H H H H H H H
charge: -0.349127 0.294471 -0.283860 -0.632505 0.313480 -0.355235 -0.714908 -0.777020 0.177352 -0.709515 -0.805442 -0.803468 0.206997 0.226551 0.220847 0.259656 0.204289 0.208608 0.225804 0.218695 0.195937 0.219409 0.210478 0.228115 0.248031 0.194181 0.211453 0.214991 0.225461 0.237136 0.219340 0.220535 0.249265
chargesum: 0.00000
title: Mulliken charges with hydrogens summed into heavy atoms:
elementType: N C C C C C C C C C C C
charge: -0.089471 0.294471 -0.076863 -0.185108 0.313480 0.057662 -0.074472 -0.119018 0.177352 -0.055850 -0.127854 -0.114328
polarizability: 1.51555181e+02 3.57441520e-01 1.27439105e+02 -1.70705053e-01 -1.86155255e+00 1.00547533e+02
1716.lowfreq: -19.6272 -8.0996 -0.0005 -0.0004 -0.0003 10.2195 31.2544 62.0062 97.9355
frequency: 30.3487 61.7979 97.9192 114.3750 127.9542 139.4623 178.5425 184.7627 206.0078 221.1268 249.6028 270.6567 296.8655 315.0052 342.1514 372.6381 386.3227 397.3785 450.4133 513.4377 515.5537 563.8379 596.4257 652.3011 753.8616 785.6412 817.7072 860.4667 880.3934 908.0190 930.3266 933.7273 950.6729 960.7244 969.2646 995.2142 1007.3865 1057.7175 1077.9129 1090.0287 1098.9692 1113.5522 1119.5432 1150.3972 1186.1114 1203.2701 1234.4285 1241.3033 1263.5130 1270.9528 1283.0571 1319.8408 1341.0961 1371.8965 1372.9128 1386.0954 1388.4127 1399.1565 1420.4985 1450.8283 1456.6149 1461.8725 1464.3575 1466.2699 1466.9182 1468.5197 1475.6401 1476.4676 1479.1402 1486.6563 1489.5064 1700.8105 2953.6010 2955.0731 2958.2901 2965.6722 2968.4707 2968.9541 2979.2057 2995.1670 3019.6389 3020.6775 3024.4622 3042.8397 3061.6020 3065.1946 3072.9102 3080.2485 3084.1260 3085.7732 3092.0885 3092.6238 3433.4450
redmass: 2.5783 2.4706 1.6424 1.4126 2.2209 1.1830 2.5674 1.4963 1.0741 1.4278 1.1693 2.1835 2.6924 2.1124 2.7724 2.5064 2.4204 2.3018 1.8285 2.4411 2.8131 3.5830 3.5661 2.0715 1.8355 2.8630 1.9740 2.8124 2.0229 1.7905 1.4794 1.8155 1.3817 1.6717 1.3254 1.8704 1.3978 2.4090 1.6387 1.6891 1.5238 2.5233 1.8919 3.6910 2.8111 1.6852 1.5812 1.5305 2.4001 2.0889 1.6768 1.4827 1.3123 1.2147 1.2253 1.2266 1.2491 1.2090 1.2591 1.0672 1.0715 1.0585 1.0570 1.0512 1.0554 1.0547 1.0745 1.0566 1.0502 1.0535 1.0606 7.9282 1.0416 1.0803 1.0389 1.0563 1.0388 1.0388 1.0374 1.0604 1.0990 1.0983 1.0961 1.0984 1.0989 1.0996 1.0983 1.0983 1.0973 1.0988 1.0960 1.0995 1.0756
irintensity: 0.0277 0.1036 0.2176 0.1111 1.9751 0.7238 0.5026 0.1772 0.0541 1.2741 0.2538 2.0668 0.1615 1.2276 1.2644 2.6285 3.7733 1.5795 17.7753 8.1192 3.8073 0.8175 31.8109 56.0915 6.7167 1.1748 4.6061 1.6950 0.2947 2.3481 3.4578 7.1671 1.4421 3.1744 2.9954 15.5517 1.6284 7.0821 2.1235 14.1769 8.8114 12.0969 8.9492 3.1266 30.4316 6.1959 14.7083 6.7211 8.6877 4.4463 11.7527 0.3021 3.4005 22.5974 22.2773 28.8049 15.0430 8.5610 6.4668 4.2254 10.9271 3.8893 2.8583 6.8271 6.1604 10.3625 8.1636 2.8054 18.2228 9.6929 9.3297 2.6465 36.6752 23.6851 76.3806 16.1744 61.6233 31.3857 26.5907 25.2100 37.0429 0.9326 39.8353 17.0467 25.1208 86.6164 13.6244 46.9058 36.8016 30.2547 39.4911 27.2017 1.1785
temp: 298.150 k
press: 1.00000 atm
elementType: 7 6 6 6 6 6 6 6 6 6 6 6 1 1 1 1 1 1 1 1 1 1 1 1 1 1 1 1 1 1 1 1 1
symmnumber: 1
zpe: 775734.2 jmol-1
zpe.correction: 0.295462 hartree
zpe.thermalcorrener: 0.310442 hartree
zpe.thermalcorrenthalpy: 0.311386 hartree
zpe.thermalcorrgfe: 0.254229 hartree
zpe.sumelectzpe: -485.522454 hartree
zpe.sumelectthermal: -485.507474 hartree
zpe.sumelectthermalent: -485.506529 hartree
zpe.sumelectthermalfe: -485.563687 hartree
dipole: -0.7541 -1.1914 -0.5954
dipole: 1.5306
quadrupole: -75.6999 -77.2910 -75.0281
quadrupole: -2.5746 -0.5694 -0.4189
quadrupole: 0.3064 -1.2847 0.9783 -2.5746 -0.5694 -0.4189
hfenergy: -485.8179157 hartree
pointgroup: C01 [X(C11H21N1)]
dipole: -0.2485868 0.4901047 0.2461969 debye
polarizability: 150.7624329|-3.5915339|128.1175571|3.4832358|-0.4805389|100.6618288 unknown
InChI: InChI=1S/C11H21N/c1-6-10-9(8(2)3)7-11(4,5)12-10/h10,12H,6-7H2,1-5H3
charge 0 multiplicity 1
33 atoms
N  1.224874 -0.719019 0.916124
C  1.757173 0.537675 0.278322
C  -0.210438 -0.904455 0.533101
C  0.492802 1.435271 0.025153
C  -0.715031 0.500891 0.147675
C  -0.377467 -1.960433 -0.600367
C  2.467134 0.200844 -1.05897
C  2.767404 1.205087 1.237748
C  -2.020783 0.873331 0.010754
C  0.084767 -3.36279 -0.158307
C  -3.189258 -0.078915 0.219314
C  -2.432037 2.292326 -0.350303
H  -0.761592 -1.292637 1.416198
H  0.544568 1.93309 -0.962041
H  0.439284 2.239923 0.786425
H  1.334225 -0.676947 1.938818
H  0.203096 -1.636491 -1.484166
H  -1.439629 -1.983193 -0.912272
H  3.268761 -0.538505 -0.886408
H  1.759733 -0.228094 -1.789674
H  2.909915 1.111243 -1.506399
H  3.185711 2.124138 0.789795
H  2.284413 1.483109 2.194655
H  3.607303 0.519136 1.455842
H  1.133826 -3.31638 0.18336
H  -0.532579 -3.740885 0.680164
H  0.014098 -4.092433 -0.986035
H  -3.951173 0.382915 0.878522
H  -3.698239 -0.304352 -0.739978
H  -2.886987 -1.038524 0.670408
H  -3.06922 2.299289 -1.257844
H  -3.03756 2.745924 0.460809
H  -1.568195 2.95016 -0.538323
