program: Gaussian 09
title: 000289271
version: EM64L-G09RevD.01
frameworkgroup: C1[X(C18H21NO4)]
method: RPBEPBE
basis: SDD
operation: Freq
keyword: #p
keyword: freq=noraman
keyword: PBEPBE/SDD
title: #p freq=noraman PBEPBE/SDD
converged: YES YES NO NO
title: Mulliken charges:
elementType: O O O O N C C C C C C C C C C C C C C C C C C H H H H H H H H H H H H H H H H H H H H H
charge: -0.246724 -0.266355 -0.426173 -0.225777 -0.148765 -0.211953 -0.449677 0.257326 0.267926 -0.554401 0.340923 -0.550484 -0.486942 0.103495 -0.521110 0.011263 -0.355064 -0.573491 -0.834269 0.332614 -0.399788 0.195580 -0.536659 0.289033 0.261741 0.247619 0.224573 0.234559 0.242861 0.233864 0.272348 0.231277 0.241436 0.244037 0.231278 0.260837 0.224880 0.287827 0.231934 0.246146 0.380206 0.246239 0.221942 0.223869
chargesum: 0.00000
title: Mulliken charges with hydrogens summed into heavy atoms:
elementType: O O O O N C C C C C C C C C C C C C C C C C C
charge: -0.246724 -0.266355 -0.045968 -0.225777 -0.148765 0.077080 0.059683 0.257326 0.267926 -0.095269 0.340923 -0.073759 0.016684 0.103495 -0.035637 0.011263 -0.123785 -0.312653 -0.089628 0.332614 -0.153642 0.195580 0.155390
polarizability: 3.22126011e+02 5.90907039e+00 1.70571786e+02 -8.72332894e+00 2.55190761e+01 1.77575751e+02
1716.lowfreq: -0.7157 -0.0004 0.0005 0.0007 3.2910 9.8558 18.8463 23.1631 40.5066
frequency: 18.5244 23.0283 40.3766 54.7251 59.1757 82.5606 93.8396 114.9546 130.4338 137.7747 161.2759 178.9342 204.3020 222.4337 233.3928 234.6543 261.0751 271.6696 288.8997 304.9406 323.0655 355.6246 372.8158 396.9676 434.2752 441.3837 468.4445 507.4496 522.7910 535.8119 539.6281 552.6926 562.1986 586.6681 588.6681 616.2073 638.3309 664.2388 678.3688 701.3328 715.0123 721.9481 754.3034 806.3809 828.4541 849.3381 852.6604 876.8542 888.1508 898.9457 932.3394 943.7240 962.8970 977.2587 1000.3722 1005.3504 1016.3690 1021.2581 1038.4639 1051.0325 1067.8990 1079.7349 1099.5395 1113.7493 1131.7481 1139.3332 1146.3315 1168.3556 1180.9155 1187.4113 1197.5357 1213.6089 1221.3004 1229.7239 1243.4665 1245.8254 1265.1090 1282.5662 1285.5174 1296.3446 1305.4552 1334.5965 1347.5039 1354.3789 1371.3079 1387.6080 1390.4012 1406.9515 1431.2391 1441.5430 1444.7456 1448.7157 1451.8661 1466.2230 1469.1187 1471.6819 1474.2265 1485.8807 1497.8988 1499.5437 1573.9762 1585.3787 1624.9160 1630.3344 1662.0196 2960.1394 2961.7386 2978.9299 2982.6050 3013.2085 3017.5799 3017.8265 3034.4219 3035.4887 3041.5348 3043.1720 3050.4979 3058.9517 3077.3311 3092.6088 3111.4149 3126.7639 3134.2166 3146.7578 3169.4873 3504.8341
redmass: 6.6344 5.2565 6.7669 4.0729 4.5423 5.0617 4.1666 4.4800 2.3166 4.2705 3.3345 4.2338 3.3367 1.0409 3.9725 1.2787 3.4205 2.9955 2.9615 3.1205 3.6610 3.7171 3.9837 4.0318 2.7119 3.3253 3.0970 4.0739 4.2657 4.1383 4.5495 3.9766 2.7774 2.8400 3.1822 3.7808 1.4543 4.3808 3.3969 4.1840 4.0335 5.1212 3.9689 1.5132 2.8320 1.6388 3.2178 2.4192 2.0633 2.5344 2.0347 1.4526 2.5882 3.3664 2.0126 3.9106 2.8976 2.2599 1.4571 2.2273 3.5513 2.3101 2.6695 1.2593 1.8926 1.1950 1.4735 2.6914 1.4866 1.4364 1.2707 1.1409 1.3959 1.4245 1.7499 1.7018 3.0428 1.5134 1.5459 2.8772 1.5706 1.5013 1.5536 1.5092 1.8697 3.0259 1.4093 3.3005 2.1029 1.5524 1.0927 1.1043 1.1088 1.1102 1.0495 1.0739 1.0802 1.1079 1.0509 2.5593 9.2907 7.6885 8.6498 7.1062 8.0745 1.0361 1.0329 1.0625 1.0601 1.0680 1.0620 1.0630 1.0997 1.0858 1.0948 1.0969 1.1041 1.0970 1.1021 1.1003 1.0964 1.0994 1.0888 1.0918 1.0942 1.0638
irintensity: 0.9580 0.8790 0.2875 0.4721 5.6555 1.8188 3.2236 3.4867 1.3563 4.2430 1.1993 1.1968 4.6640 0.2683 0.7730 0.3118 0.5486 2.7331 2.8007 2.8923 11.5228 3.4412 0.4020 0.6316 2.1540 7.1475 4.9133 3.7751 36.1630 3.2683 7.4605 8.5666 9.4171 2.8374 9.1605 3.3659 136.0928 33.3155 1.4193 8.4597 4.6317 3.0117 7.8433 29.0824 8.1286 9.6548 29.0283 4.5900 10.4061 23.1473 19.7712 12.8561 20.1964 31.3147 1.8956 53.7168 13.9790 53.1507 2.3104 18.8336 34.2228 75.3988 89.3970 0.1602 63.1765 0.3067 16.3995 17.9451 34.2712 38.6669 87.6147 1.0814 29.2350 25.5592 4.6668 31.9532 137.9451 7.8022 23.0054 143.2047 19.5524 8.7686 13.9739 28.3287 14.1692 19.5717 21.4205 260.8911 19.4635 1.3868 24.3724 7.7127 20.4205 16.9158 13.4576 42.9081 39.5465 6.5022 12.8085 116.0207 714.0951 159.7176 34.7189 56.8088 236.5185 46.1000 68.8987 29.3103 31.2873 10.2720 10.0016 16.5701 9.9017 8.2997 22.3012 39.8862 46.4294 3.8600 16.9015 6.0977 14.2512 28.2477 9.4701 4.0373 10.7633 24.4810
temp: 298.150 k
press: 1.00000 atm
elementType: 8 8 8 8 7 6 6 6 6 6 6 6 6 6 6 6 6 6 6 6 6 6 6 1 1 1 1 1 1 1 1 1 1 1 1 1 1 1 1 1 1 1 1 1
symmnumber: 1
zpe: 937023.4 jmol-1
zpe.correction: 0.356893 hartree
zpe.thermalcorrener: 0.378692 hartree
zpe.thermalcorrenthalpy: 0.379637 hartree
zpe.thermalcorrgfe: 0.304623 hartree
zpe.sumelectzpe: -1052.457937 hartree
zpe.sumelectthermal: -1052.436138 hartree
zpe.sumelectthermalent: -1052.435194 hartree
zpe.sumelectthermalfe: -1052.510208 hartree
dipole: 5.7651 -1.2100 -2.9192
dipole: 6.5744
quadrupole: -157.4820 -139.1194 -127.4314
quadrupole: 3.4800 24.3242 4.6996
quadrupole: -16.1377 2.2249 13.9128 3.4800 24.3242 4.6996
hfenergy: -1052.8148307 hartree
pointgroup: C01 [X(C18H21N1O4)]
dipole: 2.2350808 -0.6544951 1.1253219 debye
polarizability: 322.0073142|-10.0246391|151.0207981|4.1421243|-11.8420261|197.2454353 unknown
InChI: InChI=1S/C18H21NO4/c1-11-15(5-6-17(11)20)19-8-7-12-9-13(23-2)3-4-14(12)16(19)10-18(21)22/h3-4,9,16,21H,5-8,10H2,1-2H3
charge 0 multiplicity 1
44 atoms
O  -5.545474 1.312756 -1.062849
O  5.318058 0.801378 0.886906
O  -0.231478 -2.996317 -0.473243
O  1.12483 -2.72013 -2.331858
N  -1.13607 -0.039035 0.540907
C  -0.22076 0.142981 -0.615034
C  -0.563566 -0.675663 1.751939
C  -2.494763 0.192178 0.400997
C  1.252433 0.265608 -0.209194
C  0.63429 0.15072 2.254836
C  1.666719 0.306556 1.152077
C  -3.461543 -0.351689 1.462792
C  -0.474762 -0.938261 -1.739335
C  -3.184245 0.868972 -0.614602
C  -4.873359 -0.03445 0.91974
C  -4.628988 0.789198 -0.355478
C  2.233929 0.408218 -1.218587
C  3.029865 0.481964 1.466695
C  -2.726287 1.690482 -1.801012
C  3.99748 0.629479 0.446623
C  3.597758 0.59196 -0.912174
C  0.235368 -2.263042 -1.581631
C  6.357324 0.954176 -0.135119
H  -0.505119 1.097747 -1.089396
H  -0.243085 -1.706527 1.513163
H  -1.336638 -0.728061 2.531017
H  1.085244 -0.343667 3.135646
H  0.274064 1.144774 2.586748
H  -3.306056 -1.435263 1.620445
H  -3.292622 0.144537 2.438279
H  -1.565723 -1.109579 -1.786602
H  -0.152589 -0.525682 -2.709516
H  -5.496654 0.541776 1.625355
H  -5.436408 -0.949851 0.66295
H  1.941377 0.372526 -2.273928
H  3.364008 0.50614 2.509517
H  -2.103832 2.556645 -1.506226
H  -3.637337 2.085814 -2.286673
H  -2.171723 1.112013 -2.564426
H  4.323449 0.693163 -1.723797
H  0.263957 -3.859987 -0.435234
H  7.295827 1.071656 0.425957
H  6.180081 1.852471 -0.75794
H  6.419322 0.058611 -0.783336
