program: Gaussian 09
title: 000289252
version: EM64L-G09RevD.01
frameworkgroup: C1[X(C17H29NO3)]
method: RPBEPBE
basis: SDD
operation: Freq
keyword: #p
keyword: freq=noraman
keyword: PBEPBE/SDD
title: #p freq=noraman PBEPBE/SDD
converged: NO YES NO NO
title: Mulliken charges:
elementType: O O O N C C C C C C C C C C C C C C C C C H H H H H H H H H H H H H H H H H H H H H H H H H H H H H
charge: -0.262173 -0.267104 -0.227485 -0.066643 -0.051436 -0.445171 -0.438436 -0.289154 -0.413462 -0.411919 -0.383185 0.215165 0.127674 -0.484159 -0.004799 0.194753 -0.717581 -0.715812 -0.720462 -0.262362 -0.665263 0.252365 0.181140 0.233929 0.206950 0.196385 0.266462 0.195063 0.200152 0.194879 0.192810 0.197039 0.186111 0.220344 0.211260 0.222266 0.216712 0.205294 0.240179 0.218544 0.235830 0.198065 0.224698 0.238219 0.210441 0.234275 0.219887 0.214415 0.225881 0.249421
chargesum: 0.00000
title: Mulliken charges with hydrogens summed into heavy atoms:
elementType: O O O N C C C C C C C C C C C C C C C C C
charge: -0.262173 -0.267104 -0.227485 -0.066643 0.200929 -0.030103 -0.035102 -0.022692 -0.018247 -0.024230 -0.000036 0.215165 0.127674 -0.052555 0.217468 0.194753 -0.055396 -0.063373 -0.047104 0.191800 0.024454
polarizability: 2.12786720e+02 1.91019102e-01 2.01008288e+02 -4.39849593e-01 -4.92330570e-01 1.76938589e+02
1716.lowfreq: -9.4267 -0.0005 -0.0004 -0.0004 6.2466 11.9721 13.3611 26.7011 47.4127
frequency: 11.1209 26.2898 47.2773 52.4962 57.8073 79.4608 83.3100 92.0159 123.3658 133.4003 150.0323 157.3209 194.3506 201.3710 209.3994 218.8086 234.7466 237.4804 255.2311 269.1360 292.3441 306.7152 314.7109 333.1457 342.4282 388.8329 417.2880 431.1148 436.5550 443.4490 463.4022 471.8236 484.4331 506.6960 562.4237 580.0183 651.9959 694.6082 731.2090 774.8224 788.0828 789.2619 791.6630 812.1469 821.2603 832.6464 846.8824 888.9153 891.1906 898.4394 910.6379 915.1240 930.3160 937.3392 951.2976 967.6841 988.5269 995.4689 1016.2947 1033.9527 1054.1912 1058.7691 1080.9185 1084.4974 1089.3764 1093.7923 1101.4908 1107.1212 1117.6569 1142.8640 1150.2287 1156.1239 1172.8020 1191.1083 1202.3416 1219.3554 1227.1019 1256.9240 1261.2521 1263.6309 1272.0984 1278.7413 1279.9395 1291.8422 1310.8635 1316.0971 1325.9736 1332.9162 1337.1581 1341.0444 1343.9753 1356.1542 1356.3144 1363.5937 1372.0815 1388.7891 1389.0717 1392.6797 1438.3810 1452.7679 1456.6619 1459.4027 1461.4696 1462.3649 1463.3775 1465.1895 1466.8764 1469.1427 1469.7182 1476.6996 1477.2451 1484.2226 1485.1072 1628.7348 1646.4125 2952.8184 2960.8903 2963.5764 2965.9503 2969.8225 2978.7062 2980.0717 2984.0962 2990.1526 2990.8487 2991.5713 2994.3736 3019.7759 3023.0785 3025.2576 3027.4805 3030.8163 3038.1415 3049.0664 3050.8302 3075.5439 3080.7682 3086.1968 3087.9982 3089.2572 3090.9958 3094.7326 3098.1682 3116.8865
redmass: 3.6730 3.8585 3.2834 3.5527 2.9446 3.1252 4.8019 3.9736 4.4917 2.6665 2.7669 3.7441 1.0548 1.3797 1.1713 2.4497 1.5951 1.4470 2.2403 2.7571 2.6180 2.2034 2.3476 2.7554 3.4773 2.6748 3.0337 2.5694 2.9320 3.6331 2.7111 2.5280 2.7602 3.3014 3.0412 3.5500 4.9454 4.8535 4.7451 2.6944 2.7181 2.5696 1.8877 1.6124 2.4962 2.6850 1.9485 2.4257 2.0422 1.6597 1.8898 2.0515 1.7697 1.8440 2.2782 2.1564 2.4500 1.3130 2.9845 1.7492 1.9220 1.2134 2.0513 1.4848 2.6855 2.3196 2.4918 2.1361 2.4924 1.8493 2.7991 1.7256 2.1550 1.5178 2.7441 1.6779 2.0995 1.7740 1.3141 1.2756 1.2909 1.1232 1.4965 1.5125 1.2802 1.3108 1.3597 1.4469 1.3831 1.5371 1.5010 1.5275 1.3295 1.4775 1.2120 1.2344 1.2117 1.2507 1.0839 1.0556 1.0921 1.0847 1.0525 1.0432 1.0887 1.0887 1.0499 1.0643 1.0777 1.0964 1.0494 1.0516 1.0518 9.8165 10.3642 1.0660 1.0612 1.0600 1.0649 1.0625 1.0389 1.0503 1.0492 1.0470 1.0637 1.0361 1.0819 1.0873 1.0953 1.0947 1.0597 1.1005 1.1005 1.0979 1.1023 1.1001 1.0992 1.0975 1.0997 1.0993 1.1033 1.0992 1.1004 1.1058
irintensity: 0.0865 0.7804 0.4401 1.0367 0.3179 0.5910 0.0651 0.1211 1.2657 0.2672 1.3529 1.2650 0.0484 2.1357 0.6073 0.6552 0.5880 0.6265 0.9705 0.6692 3.3790 2.9353 2.0106 0.5502 11.9578 0.9624 1.7962 0.3965 0.3659 6.0665 0.6777 2.1465 4.8324 3.8645 11.0451 4.1140 7.2515 0.6784 7.2287 8.6400 3.4106 3.9797 2.6984 4.9992 0.7195 4.5840 4.2996 6.8552 16.5244 8.2329 2.2990 4.8941 2.1589 3.3962 22.0178 10.5410 45.1412 0.9022 88.3418 46.8941 4.0278 6.0089 40.2681 2.7171 19.9354 99.3045 110.0010 67.1165 7.2254 28.3443 73.2094 27.2815 20.0943 4.2312 20.7325 35.2376 27.9562 23.3413 3.1026 4.2746 16.4179 6.7463 105.7742 16.6864 2.4839 11.3052 4.6231 0.2175 0.2349 3.3757 0.4135 11.4106 3.0695 5.2449 19.6284 23.4782 15.1186 22.3349 4.8194 3.2398 9.0826 6.2411 11.7180 13.1983 4.9994 9.1213 7.6627 1.4652 20.7559 2.2264 10.5382 12.3479 14.3998 129.7108 172.7434 23.6131 37.4059 34.8752 32.0711 34.9652 19.6411 10.6599 31.7098 19.6464 49.0238 18.8725 9.6679 23.6810 76.9429 67.4028 28.1998 1.9224 84.0418 59.6184 23.1506 17.5736 60.9262 34.8104 2.9482 43.6496 1.7183 39.3865 28.1996 32.9979
temp: 298.150 k
press: 1.00000 atm
elementType: 8 8 8 7 6 6 6 6 6 6 6 6 6 6 6 6 6 6 6 6 6 1 1 1 1 1 1 1 1 1 1 1 1 1 1 1 1 1 1 1 1 1 1 1 1 1 1 1 1 1
symmnumber: 1
zpe: 1140173.3 jmol-1
zpe.correction: 0.434269 hartree
zpe.thermalcorrener: 0.457464 hartree
zpe.thermalcorrenthalpy: 0.458408 hartree
zpe.thermalcorrgfe: 0.380477 hartree
zpe.sumelectzpe: -943.967383 hartree
zpe.sumelectthermal: -943.944188 hartree
zpe.sumelectthermalent: -943.943243 hartree
zpe.sumelectthermalfe: -944.021174 hartree
dipole: -2.9424 -0.1686 1.8019
dipole: 3.4544
quadrupole: -118.2606 -117.3660 -132.8283
quadrupole: 1.1004 1.9190 2.2726
quadrupole: 4.5577 5.4523 -10.0100 1.1004 1.9190 2.2726
hfenergy: -944.4016517 hartree
pointgroup: C01 [X(C17H29N1O3)]
dipole: -1.0963864 -0.3282999 -0.7329397 debye
polarizability: 211.784121|3.2775784|201.7439123|1.7705498|-2.005293|177.2055633 unknown
InChI: InChI=1S/C17H29NO3/c1-5-20-16(19)14(13-9-7-6-8-10-13)15-18-17(3,4)11-12(2)21-15/h12-14H,5-11H2,1-4H3
charge 0 multiplicity 1
50 atoms
O  -1.315647 -0.090122 -1.540854
O  1.082611 -2.535905 -0.378983
O  2.100495 -1.354395 1.35395
N  -1.276584 -0.310547 0.884868
C  1.425539 1.189028 0.106971
C  2.929366 1.293195 -0.263168
C  0.655191 2.417415 -0.442647
C  0.820517 -0.148485 -0.415216
C  3.549842 2.620504 0.233465
C  1.271632 3.745273 0.057788
C  2.77197 3.844458 -0.303905
C  -2.769988 -0.274441 1.002475
C  -0.699103 -0.20467 -0.270925
C  -3.418903 0.321082 -0.282634
C  -2.804318 -0.279922 -1.55885
C  1.418313 -1.363609 0.307192
C  -3.258114 -1.721771 1.273237
C  -3.09591 0.614793 2.224702
C  -3.295375 0.358278 -2.856509
C  1.552308 -3.819413 0.227392
C  2.969017 -4.157212 -0.24652
H  1.332984 1.177466 1.21164
H  3.0321 1.235511 -1.368636
H  3.482335 0.438454 0.166973
H  -0.408362 2.36319 -0.139863
H  0.674286 2.396867 -1.552624
H  1.037281 -0.260062 -1.494721
H  4.6133 2.676564 -0.070836
H  3.533172 2.634911 1.342723
H  1.159687 3.805194 1.160392
H  0.715972 4.603734 -0.368221
H  3.203271 4.781958 0.098418
H  2.878452 3.888377 -1.408067
H  -3.257405 1.417294 -0.298218
H  -4.510609 0.14236 -0.282421
H  -2.970322 -1.375841 -1.583679
H  -3.082536 -2.383166 0.405767
H  -4.338214 -1.726836 1.510515
H  -2.706801 -2.143066 2.131628
H  -2.7166 1.641406 2.073393
H  -2.60996 0.204022 3.126389
H  -4.187657 0.662338 2.395286
H  -3.111326 1.447026 -2.847625
H  -2.769884 -0.07542 -3.724554
H  -4.379905 0.185086 -2.980961
H  1.508198 -3.724477 1.326616
H  0.812445 -4.557562 -0.122092
H  3.267276 -5.149149 0.141515
H  3.018234 -4.188538 -1.348797
H  3.692327 -3.411374 0.123328
