program: Gaussian 09
title: 000289249
version: EM64L-G09RevD.01
frameworkgroup: C1[X(C17H31NO3)]
method: RPBEPBE
basis: SDD
operation: Freq
keyword: #p
keyword: freq=noraman
keyword: PBEPBE/SDD
title: #p freq=noraman PBEPBE/SDD
converged: YES YES NO NO
title: Mulliken charges:
elementType: O O O N C C C C C C C C C C C C C C C C C H H H H H H H H H H H H H H H H H H H H H H H H H H H H H H H
charge: -0.274189 -0.268552 -0.225922 -0.075969 -0.008907 -0.298704 0.221721 -0.487203 -0.000620 0.116695 -0.402328 -0.419141 -0.720545 -0.718386 -0.379842 0.186414 -0.719005 -0.725747 -0.707880 -0.260219 -0.663351 0.204170 0.275830 0.234114 0.208862 0.216427 0.223101 0.188625 0.256342 0.205243 0.234131 0.208045 0.216440 0.226601 0.196714 0.233833 0.212875 0.197943 0.234385 0.208584 0.231352 0.204487 0.218621 0.215218 0.213977 0.211099 0.209256 0.232149 0.220902 0.226490 0.251806 0.214056
chargesum: 0.00000
title: Mulliken charges with hydrogens summed into heavy atoms:
elementType: O O O N C C C C C C C C C C C C C C C C C
charge: -0.274189 -0.268552 -0.225922 -0.075969 0.195263 -0.022874 0.221721 -0.044227 0.215807 0.116695 0.009397 0.042444 -0.061928 -0.061238 0.030977 0.186414 -0.044684 -0.087421 -0.073547 0.192832 0.029000
polarizability: 2.14157351e+02 -2.26077949e+00 2.01813294e+02 -3.10186172e+00 5.68507767e+00 1.84382659e+02
1716.lowfreq: -19.0440 -8.2968 0.0001 0.0005 0.0009 4.1302 9.1529 31.2068 38.1787
frequency: -12.5033 31.1466 38.1030 45.0518 51.8884 60.1113 77.9305 84.3744 91.5540 97.1118 119.0988 135.3004 137.9507 159.3709 169.7606 190.2602 195.0469 206.7494 213.4620 227.5277 231.7524 237.2131 242.5476 271.9213 277.8111 302.3399 314.4958 327.4313 336.0563 395.7933 420.2931 433.3899 443.5754 453.6119 460.9797 484.4823 499.1065 553.2535 589.0968 668.4325 680.6950 723.6002 744.0372 759.0704 780.5835 791.0752 809.1993 812.6123 827.0865 855.8291 876.1035 889.4903 903.1670 911.7643 921.3820 931.2975 944.4204 976.1971 984.5084 995.4762 1009.3935 1017.1806 1035.6422 1038.4176 1057.3998 1073.9318 1083.3323 1092.1191 1099.6474 1105.3578 1124.7124 1143.1005 1150.7884 1156.6052 1164.0347 1175.1878 1202.7436 1225.4243 1230.1802 1242.5488 1258.5974 1269.9578 1279.0144 1281.8267 1288.6877 1294.9585 1307.6275 1319.7967 1332.1736 1338.7474 1352.8294 1356.2875 1358.8791 1363.7233 1372.5275 1388.1753 1390.1769 1391.3252 1391.8028 1392.2994 1438.9186 1454.1703 1456.8756 1461.3737 1463.4159 1463.5480 1466.7720 1469.6435 1474.0271 1475.4611 1476.3618 1477.3667 1480.6107 1485.0964 1485.8300 1487.4536 1488.4993 1633.6799 1647.2401 2959.1497 2963.0218 2969.7000 2971.0762 2976.0778 2978.7421 2979.6269 2981.5797 2982.9063 2989.5065 2992.4146 2992.6103 3005.5516 3023.5032 3027.2885 3042.2777 3047.2135 3055.6344 3065.9661 3067.6880 3069.1557 3075.8566 3076.1884 3081.4260 3086.4523 3086.9654 3088.9836 3092.2228 3093.6166 3099.0116 3117.9747
redmass: 3.5689 3.4197 4.1616 3.7770 3.4074 2.4598 2.8828 2.1389 2.4085 3.8347 2.8989 2.6738 3.3092 2.4078 2.4207 1.2039 2.4768 1.4362 1.1991 1.9199 1.2477 1.3170 1.1588 2.5203 2.2283 2.5003 2.6424 3.5020 3.0239 2.8273 3.1505 3.1467 3.1255 3.6123 2.8613 3.2094 3.5660 3.1609 6.0397 5.9522 3.2803 3.7641 1.2864 1.6390 2.9887 1.9677 1.8118 2.0446 3.3936 2.2632 1.3640 1.8601 2.1137 2.4437 2.2140 1.5452 2.1909 1.7921 2.0221 1.2878 2.0936 2.8230 1.8412 1.8859 2.5649 2.4884 2.1669 2.2853 2.1176 2.0353 3.6501 1.8810 2.2295 1.6778 2.4853 2.1577 2.8698 2.1477 1.3915 1.4592 1.8451 1.2879 1.1162 1.2058 1.3067 1.4893 1.1543 1.2401 1.3609 1.4438 1.5030 1.3285 1.5250 1.5196 1.2109 1.2137 1.2116 1.2239 1.2332 1.2385 1.0830 1.0554 1.0937 1.0485 1.0467 1.0640 1.0515 1.0608 1.0547 1.0600 1.0492 1.0430 1.0551 1.0513 1.0526 1.0800 1.0628 9.1527 10.9216 1.0596 1.0823 1.0363 1.0372 1.0705 1.0648 1.0441 1.0593 1.0395 1.0407 1.0379 1.0534 1.0980 1.0806 1.0599 1.1011 1.0969 1.1030 1.1002 1.0980 1.0994 1.0998 1.0997 1.0995 1.0995 1.0976 1.0990 1.1033 1.0997 1.1006 1.1055
irintensity: 0.0853 0.0739 0.7342 1.7174 0.7940 0.5681 0.2670 0.2420 0.1006 0.5065 0.7504 0.2259 0.8818 0.4182 0.4090 0.1333 1.2351 3.1761 1.0854 0.6096 0.0156 0.0103 0.0049 2.9022 0.3156 1.1877 1.4978 10.5472 3.4219 0.3774 2.9498 1.3219 4.7016 3.8762 3.6221 1.1998 3.4524 4.4454 12.8783 5.5890 2.5418 8.4365 8.3489 2.5746 11.8226 0.8543 5.5137 1.4726 9.6930 4.4557 2.4999 9.1006 1.2167 18.4925 9.1337 2.0171 43.5784 15.3982 27.6202 1.3990 43.2055 73.6201 62.4729 4.6051 3.3277 34.0139 16.5742 133.2362 16.9908 21.5345 247.3165 26.4477 30.8395 11.4245 13.3296 16.0031 15.3119 16.1478 4.6892 42.2174 25.5538 29.6858 1.2093 30.0562 10.2075 18.1355 13.5560 7.8779 2.5549 17.1536 5.1174 6.5288 12.1720 0.7953 20.5536 10.5478 11.3174 11.6569 2.0858 47.7882 4.2403 3.1023 11.7538 10.0471 17.1378 9.8875 3.3279 5.6310 3.0404 5.1028 10.9540 9.8212 7.0226 10.7354 17.7918 8.7020 15.2113 86.1609 177.7441 22.6280 20.4192 37.2650 40.3863 3.1037 25.2140 47.1380 39.4542 37.4548 14.4372 17.2562 45.4414 6.8589 7.9243 30.5389 25.8575 3.2668 17.5955 57.8968 90.5816 37.1540 25.9722 54.8811 27.2678 21.1186 39.8934 46.2917 1.7904 34.7522 29.4938 33.0259
temp: 298.150 k
press: 1.00000 atm
elementType: 8 8 8 7 6 6 6 6 6 6 6 6 6 6 6 6 6 6 6 6 6 1 1 1 1 1 1 1 1 1 1 1 1 1 1 1 1 1 1 1 1 1 1 1 1 1 1 1 1 1 1 1
symmnumber: 1
zpe: 1189541.9 jmol-1
zpe.correction: 0.453073 hartree
zpe.thermalcorrener: 0.477911 hartree
zpe.thermalcorrenthalpy: 0.478855 hartree
zpe.thermalcorrgfe: 0.398580 hartree
zpe.sumelectzpe: -945.135744 hartree
zpe.sumelectthermal: -945.110905 hartree
zpe.sumelectthermalent: -945.109961 hartree
zpe.sumelectthermalfe: -945.190236 hartree
dipole: -0.8335 -0.7849 -1.3228
dipole: 1.7494
quadrupole: -110.8343 -128.8098 -132.8292
quadrupole: 0.4122 0.8509 2.1531
quadrupole: 13.3235 -4.6520 -8.6715 0.4122 0.8509 2.1531
hfenergy: -945.5888162 hartree
pointgroup: C01 [X(C17H31N1O3)]
dipole: 0.3353222 0.13627 0.5854201 debye
polarizability: 214.0443594|-0.2330927|187.9549875|-3.9262162|-9.1035905|198.3539573 unknown
InChI: InChI=1S/C17H31NO3/c1-7-10-13(8-2)14(16(19)20-9-3)15-18-17(5,6)11-12(4)21-15/h12-14H,7-11H2,1-6H3
charge 0 multiplicity 1
52 atoms
O  0.975621 0.045548 1.635521
O  -3.053923 -0.300104 0.826962
O  -1.418963 -1.939668 0.546544
N  1.311955 -0.262363 -0.756756
C  -1.343979 1.164304 -1.136356
C  -0.874744 0.474079 0.198114
C  2.703886 -0.790401 -0.571472
C  2.899135 -1.328915 0.875689
C  2.398116 -0.324929 1.926846
C  0.58743 0.055774 0.268248
C  -0.46626 2.397387 -1.4796
C  -1.452506 0.167628 -2.324146
C  3.701435 0.349111 -0.906016
C  2.873348 -1.941968 -1.589414
C  -0.347568 3.452245 -0.354312
C  -1.755525 -0.735131 0.533355
C  2.411128 -0.856969 3.359271
C  -2.143758 0.763796 -3.570432
C  0.390858 4.726008 -0.819995
C  -4.04867 -1.362287 1.172193
C  -3.982959 -1.700174 2.664286
H  -2.369242 1.530523 -0.912609
H  -1.040599 1.197836 1.018015
H  2.326233 -2.269819 0.988109
H  3.965681 -1.554027 1.064082
H  2.97894 0.617859 1.864839
H  0.542642 2.049121 -1.774084
H  -0.906135 2.891522 -2.368537
H  -0.440267 -0.196147 -2.574883
H  -2.030653 -0.720026 -1.997033
H  3.474185 0.760682 -1.905049
H  4.738292 -0.035162 -0.913759
H  3.638171 1.178615 -0.178783
H  2.719922 -1.564546 -2.615444
H  3.885823 -2.381407 -1.518165
H  2.127363 -2.734625 -1.403954
H  0.190696 3.023835 0.514546
H  -1.361636 3.723624 0.0068
H  1.982326 -0.113388 4.052965
H  3.447123 -1.07608 3.676616
H  1.81544 -1.783592 3.431109
H  -3.134845 1.188013 -3.3161
H  -1.542314 1.566333 -4.034185
H  -2.299945 -0.015675 -4.339158
H  0.486228 5.46338 -0.001515
H  1.409421 4.482098 -1.177454
H  -0.14683 5.214453 -1.654742
H  -3.842755 -2.251844 0.550963
H  -5.01504 -0.914629 0.889423
H  -4.134824 -0.796807 3.279971
H  -3.007466 -2.146822 2.919148
H  -4.77479 -2.429671 2.917738
