program: Gaussian 09
title: 000289212
version: EM64L-G09RevD.01
frameworkgroup: C1[X(C13H9N3OS)]
method: RPBEPBE
basis: SDD
operation: Freq
keyword: #p
keyword: freq=noraman
keyword: PBEPBE/SDD
title: #p freq=noraman PBEPBE/SDD
converged: YES YES NO NO
title: Mulliken charges:
elementType: S O N N N C C C C C C C C C C C C C H H H H H H H H H
charge: 0.300621 -0.240924 -0.301933 -0.101652 0.036620 0.573327 -0.395127 0.382097 -0.130837 -0.311674 -0.257114 -0.340420 -0.344546 -0.217530 -0.239536 -0.203327 -0.206684 -0.228475 0.269696 0.250696 0.257956 0.268009 0.235658 0.237752 0.235274 0.236452 0.235622
chargesum: 0.00000
title: Mulliken charges with hydrogens summed into heavy atoms:
elementType: S O N N N C C C C C C C C C C C C C
charge: 0.300621 -0.240924 -0.301933 -0.101652 0.036620 0.573327 -0.395127 0.382097 -0.130837 -0.041978 -0.006418 -0.082465 -0.076537 0.018129 -0.001784 0.031947 0.029768 0.007147
polarizability: 2.56243118e+02 -1.15742093e+01 1.85367855e+02 3.85264828e+00 1.12785578e+01 1.13916281e+02
1716.lowfreq: -7.7393 -0.0018 -0.0015 -0.0005 6.5998 7.1957 38.5321 43.0360 66.9991
frequency: 38.4736 43.0081 66.9960 72.8489 99.0271 137.9936 169.1780 174.5750 232.5613 253.4222 268.3409 319.2588 381.5729 403.5754 418.0657 434.8938 441.9063 480.7127 517.2173 534.2664 582.8493 610.8182 619.1617 661.7751 681.1019 690.1491 696.9822 721.9104 756.9182 757.7161 802.8771 845.5480 856.8606 859.9604 923.0631 942.1275 952.3561 976.9285 983.8498 990.5103 999.7805 1020.1066 1023.2932 1049.8941 1080.8277 1110.2509 1130.3204 1173.4139 1175.3964 1182.0453 1221.1552 1256.2637 1288.6618 1311.8457 1316.0197 1382.6319 1395.4888 1438.9579 1443.8682 1452.5041 1469.2019 1480.4676 1590.3730 1596.4478 1598.9469 1606.9636 3137.1645 3142.6853 3147.1786 3154.8625 3157.8655 3167.2860 3168.1153 3177.6980 3178.1481
redmass: 4.1439 9.2090 5.4587 5.5964 10.0497 10.7087 5.2091 9.1846 5.4408 5.6312 6.9361 9.3862 8.6138 2.8217 4.0291 8.2954 5.1754 7.0121 4.3659 5.0465 7.3841 7.5057 6.8495 6.6808 6.6137 5.0654 2.3377 3.9323 1.4188 1.9550 4.3995 1.2790 8.3288 1.3377 1.5942 1.3848 4.7625 1.3985 1.3226 5.0341 1.3841 2.8499 2.2978 3.2156 1.5492 4.6832 1.5333 1.0871 1.0542 1.1196 2.7522 8.9196 1.7521 2.0438 2.0431 9.7540 8.9136 2.2330 2.4680 2.7360 9.4434 2.4764 7.1851 6.7284 6.6585 6.2765 1.0856 1.0860 1.0890 1.0904 1.0935 1.0957 1.0968 1.1009 1.1006
irintensity: 0.4365 0.4966 1.6685 0.2802 0.5550 1.4654 0.0738 6.1619 0.7207 3.7838 9.6151 9.9884 8.4981 0.1594 6.6088 5.9568 8.3155 2.1118 44.9431 0.4418 7.1156 18.1893 5.9366 29.5031 33.2178 8.4895 26.6620 2.7299 73.5625 36.0181 214.3388 6.4888 157.4761 0.2217 22.8044 1.3535 27.3828 0.4561 0.0707 3.5069 0.0703 26.5519 12.0179 14.4249 9.7958 102.2827 2.8125 5.4089 0.0509 0.8139 64.2838 228.1661 9.1167 27.4775 23.6564 2.7306 2.8377 8.7291 42.9531 137.7716 460.2858 94.0994 2.0307 11.7175 5.4988 4.2493 0.0222 0.9070 6.0556 6.6883 20.5939 15.5117 6.2078 12.4937 9.3468
temp: 298.150 k
press: 1.00000 atm
elementType: 16 8 7 7 7 6 6 6 6 6 6 6 6 6 6 6 6 6 1 1 1 1 1 1 1 1 1
symmnumber: 1
zpe: 500203.5 jmol-1
zpe.correction: 0.190517 hartree
zpe.thermalcorrener: 0.205386 hartree
zpe.thermalcorrenthalpy: 0.206330 hartree
zpe.thermalcorrgfe: 0.147293 hartree
zpe.sumelectzpe: -1136.996951 hartree
zpe.sumelectthermal: -1136.982082 hartree
zpe.sumelectthermalent: -1136.981138 hartree
zpe.sumelectthermalfe: -1137.040175 hartree
dipole: 2.8610 -6.2193 0.8182
dipole: 6.8945
quadrupole: -96.6478 -116.4180 -109.8110
quadrupole: 11.7069 -4.1954 2.7126
quadrupole: 10.9778 -8.7924 -2.1854 11.7069 -4.1954 2.7126
hfenergy: -1137.1874683 hartree
pointgroup: C01 [X(C13H9N3O1S1)]
dipole: 1.0334074 -2.5076475 0.037959 debye
polarizability: 255.0534615|-15.1182045|182.4552999|6.1847663|19.3200184|118.0184926 unknown
InChI: InChI=1S/C13H9N3OS/c17-15-14-13-16(10-6-2-1-3-7-10)11-8-4-5-9-12(11)18-13/h1-9H
charge 0 multiplicity 1
27 atoms
S  2.145401 1.980861 0.607679
O  -1.923312 2.277506 -1.072731
N  0.169196 0.253438 0.148708
N  -0.55329 2.534194 0.749659
N  -1.816708 2.743968 0.122923
C  1.358751 -0.510297 0.003444
C  2.538775 0.25177 0.211704
C  -1.148102 -0.363055 0.094367
C  0.343086 1.600124 0.46989
C  1.437405 -1.887701 -0.295277
C  3.811956 -0.33764 0.120843
C  -1.850666 -0.581266 1.299184
C  -1.691338 -0.741993 -1.152345
C  2.715307 -2.479053 -0.391214
C  3.892433 -1.715676 -0.187929
C  -3.122351 -1.195033 1.251165
C  -2.955715 -1.367977 -1.188105
C  -3.672016 -1.593655 0.010928
H  0.527717 -2.475597 -0.446037
H  4.718739 0.252466 0.283915
H  -1.413798 -0.267325 2.252717
H  -1.144317 -0.519878 -2.073127
H  2.794709 -3.545542 -0.625564
H  4.873944 -2.19364 -0.267586
H  -3.67956 -1.360758 2.179014
H  -3.388716 -1.658861 -2.150673
H  -4.65863 -2.068082 -0.022553
