program: Gaussian 09
title: 000289218
version: EM64L-G09RevD.01
frameworkgroup: C1[X(C19H21N3O2)]
method: RPBEPBE
basis: SDD
operation: Freq
keyword: #p
keyword: freq=noraman
keyword: PBEPBE/SDD
title: #p freq=noraman PBEPBE/SDD
converged: YES YES NO NO
title: Mulliken charges:
elementType: O O N N N C C C C C C C C C C C C C C C C C C C H H H H H H H H H H H H H H H H H H H H H
charge: -0.187962 -0.301947 -0.483526 -0.195863 0.027520 0.342292 -0.477137 -0.339233 -0.712953 -0.710934 -0.467473 -0.425594 0.451395 0.290760 -0.208015 0.262111 -0.541625 -0.447329 0.438084 -0.055571 -0.408234 -0.330180 -0.249892 -0.227776 0.221502 0.244563 0.292065 0.236214 0.214433 0.236958 0.210275 0.219853 0.211710 0.230463 0.213780 0.252842 0.256749 0.246543 0.237715 0.219192 0.256684 0.235112 0.262580 0.229004 0.230844
chargesum: 0.00000
title: Mulliken charges with hydrogens summed into heavy atoms:
elementType: O O N N N C C C C C C C C C C C C C C C C C C C
charge: -0.187962 -0.301947 -0.191460 -0.195863 0.027520 0.342292 -0.011072 0.111414 -0.045866 -0.054981 0.042118 0.058664 0.451395 0.290760 -0.208015 0.262111 -0.322433 -0.190645 0.438084 -0.055571 -0.173122 -0.067600 -0.020888 0.003067
polarizability: 4.19389064e+02 6.45538182e+00 2.27812468e+02 3.30791576e+00 -3.81986468e+00 1.25600394e+02
1716.lowfreq: -5.3102 0.0004 0.0005 0.0011 2.6482 8.1637 10.2972 28.5767 39.9815
frequency: 8.9481 28.5191 39.9567 52.2001 70.1598 85.7841 116.0744 130.1484 144.1388 163.2639 174.7169 211.9114 231.9409 246.8779 262.6111 269.4205 284.1368 290.1839 295.2831 323.7554 333.9544 387.5292 398.6831 413.1606 431.1570 447.0417 471.1793 480.7587 513.6765 527.0011 538.2036 539.4205 573.4311 613.8656 624.6650 665.7654 670.2453 684.3448 715.6231 728.3679 737.2603 765.2084 767.4624 772.5488 796.5718 800.6011 826.6202 850.5529 875.8432 890.4094 893.1610 909.7509 913.1224 934.1139 945.2618 966.8061 981.3677 993.9459 995.7739 1001.2885 1018.3772 1019.9277 1023.5766 1045.5847 1065.3931 1096.8493 1139.3487 1148.7797 1150.4986 1157.8360 1165.1933 1167.4863 1179.2017 1211.1177 1214.3629 1225.5985 1236.7111 1240.1942 1260.4469 1266.4777 1291.0132 1300.9847 1319.5288 1326.7293 1340.3550 1363.3889 1373.8159 1385.0384 1392.0818 1393.4290 1404.9915 1416.7317 1450.4723 1457.3152 1460.9582 1462.0749 1467.0331 1473.4636 1474.5566 1482.2593 1482.6960 1487.6394 1503.4291 1543.4764 1563.0249 1621.9732 1629.9636 1634.3453 2944.3347 2970.5475 2973.1842 2978.8400 2986.2793 3000.6239 3005.3024 3005.9725 3064.4422 3070.2033 3075.9251 3083.4932 3088.7639 3112.7688 3119.7128 3127.9665 3135.4722 3139.7085 3153.8985 3168.7405 3540.5054
redmass: 4.1811 3.9356 4.6193 4.8838 4.9423 4.3576 5.0995 4.3004 4.2891 3.3471 5.0668 3.8388 1.0524 2.9495 1.2506 2.5271 5.5482 2.7275 3.5169 2.8482 1.9659 5.1443 3.6448 3.0239 2.2267 3.8419 3.8966 2.8989 3.1493 6.2762 2.5597 1.7973 5.1773 6.7658 3.8441 3.7270 3.6023 2.4908 6.0882 5.4590 2.6406 1.4071 3.1635 3.6041 2.7852 5.1421 4.1331 3.4253 1.4741 5.4624 2.4241 1.5729 1.6378 2.5504 2.5169 1.3893 1.3643 1.4142 1.5217 1.7964 2.1676 1.8677 1.9259 2.1979 2.9828 2.4738 2.1306 1.1457 1.5839 1.0872 2.3350 1.3020 2.2895 1.7435 1.9474 1.8110 2.2713 2.1034 2.4577 1.7824 1.8867 1.8871 1.9481 1.9646 1.4046 2.3109 1.2288 2.1451 1.3437 3.4752 2.9113 4.7579 1.1315 1.4115 1.1583 2.4053 1.0753 1.0976 1.0976 1.0730 1.0980 1.1861 3.8389 10.8115 8.2539 6.5955 7.3293 6.6387 1.0574 1.0591 1.0353 1.0358 1.1031 1.0675 1.1030 1.0599 1.1017 1.1005 1.0988 1.1006 1.1000 1.1001 1.0873 1.0928 1.0889 1.0883 1.0947 1.0996 1.0762
irintensity: 0.1840 1.3624 1.8334 1.9732 6.1350 1.3772 1.7504 2.2043 2.6069 5.5488 1.8176 5.6320 0.1488 4.4837 0.9121 0.8302 6.7535 4.9559 1.1296 6.3808 8.2433 2.6454 0.0126 4.3266 5.2602 0.7671 1.2060 8.2552 11.6503 4.7029 18.9898 50.6177 3.3180 2.1385 6.2385 13.3879 2.7863 12.7438 2.1085 0.1372 10.6980 111.4777 11.0243 35.6119 8.9628 17.7400 1.7571 12.4944 12.9737 0.3789 9.3441 16.2267 1.0650 24.3882 15.6085 4.8609 7.9770 2.4864 2.0220 18.5350 7.8823 0.5663 26.5308 18.5639 80.1599 1.1029 11.6900 10.1782 28.5119 0.5262 5.3451 24.4964 112.3349 21.8793 154.6974 218.7200 0.9048 45.0897 9.3486 95.6438 17.2118 3.1660 100.0211 176.0209 7.4445 245.0573 25.6424 70.0555 5.7275 11.3859 8.3555 38.3092 6.0374 64.6670 8.3871 0.2469 10.4505 11.8935 2.9835 26.2139 24.2513 5.5404 3.0415 244.6031 29.0580 9.5184 423.8034 825.2320 39.1087 28.1185 19.5239 29.4198 20.3198 44.0207 18.3209 26.8643 12.6026 12.9652 64.9032 28.4802 52.9475 20.3259 3.0325 9.3768 12.0931 13.6150 26.6427 28.8981 17.9689
temp: 298.150 k
press: 1.00000 atm
elementType: 8 8 7 7 7 6 6 6 6 6 6 6 6 6 6 6 6 6 6 6 6 6 6 6 1 1 1 1 1 1 1 1 1 1 1 1 1 1 1 1 1 1 1 1 1
symmnumber: 1
zpe: 957540.0 jmol-1
zpe.correction: 0.364708 hartree
zpe.thermalcorrener: 0.386045 hartree
zpe.thermalcorrenthalpy: 0.386989 hartree
zpe.thermalcorrgfe: 0.312674 hartree
zpe.sumelectzpe: -1049.586804 hartree
zpe.sumelectthermal: -1049.565467 hartree
zpe.sumelectthermalent: -1049.564523 hartree
zpe.sumelectthermalfe: -1049.638838 hartree
dipole: -3.5784 3.4588 -0.2434
dipole: 4.9828
quadrupole: -82.4053 -142.5570 -144.0492
quadrupole: -18.0803 0.7041 -1.2837
quadrupole: 40.5986 -19.5532 -21.0454 -18.0803 0.7041 -1.2837
hfenergy: -1049.9515122 hartree
pointgroup: C01 [X(C19H21N3O2)]
dipole: 1.4154352 1.3408542 0.2042393 debye
polarizability: 419.3423019|-7.569478|226.4794362|1.2064572|12.5140648|126.9801886 unknown
InChI: InChI=1S/C19H21N3O2/c1-19(2)7-8-24-17(21-19)10-18(23)22-11-14-9-13-5-3-4-6-15(13)20-16(14)12-22/h3-6,9-10,21H,7-8,11-12H2,1-2H3
charge 0 multiplicity 1
45 atoms
O  4.198801 -1.404631 -0.410066
O  1.521599 -2.431409 -0.189887
N  4.485448 0.746441 0.531503
N  -0.092779 -0.798653 0.04371
N  -3.029948 1.34536 0.188309
C  5.849029 1.032196 -0.01359
C  6.311992 -0.22454 -0.809204
C  5.670432 -1.484945 -0.2214
C  5.800758 2.272603 -0.944855
C  6.793418 1.300449 1.184671
C  -1.14415 -1.837785 -0.116334
C  -0.62616 0.5741 0.187929
C  3.611909 -0.247742 0.085349
C  -2.422963 -1.035412 -0.067019
C  -2.126527 0.361401 0.106026
C  1.254995 -1.191914 -0.010027
C  2.234862 -0.113756 0.165475
C  -3.752594 -1.429542 -0.157819
C  -4.774216 -0.421704 -0.076056
C  -4.36859 0.962842 0.097078
C  -6.170628 -0.728803 -0.158117
C  -5.371103 1.979271 0.179244
C  -7.129206 0.284512 -0.073895
C  -6.72646 1.64746 0.095611
H  7.414698 -0.293702 -0.783824
H  6.003838 -0.143233 -1.86792
H  4.051237 1.504256 1.061806
H  5.958422 -2.399937 -0.760115
H  5.894011 -1.601892 0.856984
H  5.066664 2.119135 -1.755766
H  5.513705 3.181161 -0.382299
H  6.790981 2.456576 -1.401108
H  6.410243 2.124891 1.814942
H  6.885666 0.403483 1.822358
H  7.799135 1.586712 0.827144
H  -1.073143 -2.595808 0.688778
H  -1.006315 -2.387062 -1.068558
H  -0.275278 1.249954 -0.618695
H  -0.3493 1.038869 1.157116
H  1.871433 0.889207 0.412079
H  -4.036309 -2.480542 -0.289233
H  -6.477787 -1.7738 -0.288577
H  -5.035068 3.012728 0.30907
H  -8.195135 0.039738 -0.137664
H  -7.488624 2.431862 0.159749
