program: Gaussian 09
title: 000027726
version: EM64L-G09RevD.01
frameworkgroup: C1[X(C11H13BrN2O3S)]
method: RPBEPBE
basis: SDD
operation: Freq
keyword: #p
keyword: freq=noraman
keyword: PBEPBE/SDD
title: #p freq=noraman PBEPBE/SDD
converged: YES YES NO NO
title: Mulliken charges:
elementType: Br S O O O N N C C C C C C C C C C C H H H H H H H H H H H H H
charge: -0.014759 0.155006 -0.253678 -0.271791 -0.197533 -0.602712 -0.346837 0.384263 0.216970 -0.860721 -0.263545 -0.334757 -0.229357 -0.203179 -0.363148 0.216653 -0.062652 -0.495651 0.319627 0.308877 0.307445 0.248502 0.247395 0.241473 0.247286 0.318976 0.329931 0.247088 0.237356 0.244935 0.228536
chargesum: 0.00000
title: Mulliken charges with hydrogens summed into heavy atoms:
elementType: Br S O O O N N C C C C C C C C C C C
charge: -0.014759 0.155006 -0.253678 -0.271791 -0.197533 0.046195 -0.118301 0.384263 0.216970 -0.232218 0.043900 -0.086254 -0.229357 0.044217 0.125611 0.216653 -0.062652 0.233729
polarizability: 2.49410404e+02 7.26395267e-01 1.91459860e+02 -7.73188215e+00 3.39434726e+00 1.05343227e+02
1716.lowfreq: -5.8375 -3.8559 -0.0015 -0.0005 -0.0004 4.1473 15.0336 21.0468 28.1218
frequency: 14.8700 21.0323 28.0569 32.9270 50.3443 59.0829 85.8042 90.7600 104.9619 124.6241 144.3947 156.4949 177.4713 189.3318 229.3252 251.7933 301.5485 318.5899 330.5940 335.1401 383.8654 402.9661 408.8591 447.6269 460.6674 496.5525 532.7955 558.7433 566.7593 577.1421 591.0801 610.9204 640.3303 668.6270 724.8104 747.1736 760.9033 802.3665 851.4078 866.5404 890.2414 922.7691 938.7681 947.3315 995.1912 1004.1021 1029.4227 1044.4055 1076.1363 1113.8525 1118.6465 1137.3682 1149.4731 1183.5635 1200.9817 1205.3435 1236.6638 1257.8307 1279.1607 1288.6278 1357.8029 1380.3815 1397.5700 1423.5670 1427.2841 1450.4863 1453.4992 1464.2335 1476.3245 1582.3946 1591.2798 1611.4912 1637.2367 1683.8299 2961.2778 3007.6375 3023.7075 3042.1505 3111.2241 3133.3918 3153.5486 3153.8795 3155.5051 3174.4109 3369.6719 3527.0075 3674.5454
redmass: 5.8523 7.7555 5.8407 5.2061 5.7066 6.1475 1.4783 2.2140 5.9585 4.6700 6.7641 5.4776 3.8394 7.0321 5.6733 3.7147 3.5222 6.5197 1.0860 6.1248 4.0431 3.1259 1.2728 4.4077 5.7639 4.2208 4.2580 3.1702 3.7410 5.0225 2.8203 7.6190 6.1616 5.3438 1.4288 3.5933 5.1549 1.5873 5.9558 6.0262 1.7937 1.3676 1.3862 6.3210 1.7513 1.8914 6.4607 1.5506 2.0688 1.2687 2.3672 3.7304 1.4294 1.2820 1.0988 1.5977 3.7552 1.2135 1.2735 2.6613 1.7453 4.1772 3.3786 1.1845 1.1870 1.1749 1.0497 1.0506 2.1153 7.3482 7.3386 1.6151 2.3748 10.0857 1.0570 1.0295 1.1022 1.0595 1.1049 1.1063 1.0882 1.1048 1.0933 1.0968 1.0768 1.0448 1.1043
irintensity: 2.3659 0.3053 0.3664 7.3113 0.6230 6.1102 0.4858 1.7693 2.3903 3.8323 1.7655 4.1651 11.8163 1.7769 6.9880 21.7212 2.6564 8.7535 15.2668 2.4828 5.2698 4.5586 289.9076 1.0214 5.3705 4.6770 6.7229 26.7195 14.2329 12.1132 60.0589 8.7998 11.8166 32.0659 84.0564 5.1335 2.9508 54.3605 45.5641 5.9197 17.8974 6.1216 11.9228 9.5836 123.8500 0.8317 91.7699 7.1167 2.7595 4.4409 275.9350 311.7238 3.5173 23.3508 18.4267 73.4720 115.0834 17.1600 7.1180 196.6802 31.2692 12.8195 13.6635 18.6801 26.1357 107.3524 15.3212 14.3545 117.6426 6.1662 4.4730 87.6584 243.5666 169.3916 49.6670 33.0441 15.5704 8.0400 24.3555 5.2252 9.1495 13.8803 11.0211 9.2427 19.9324 37.7072 23.4243
temp: 298.150 k
press: 1.00000 atm
elementType: 35 16 8 8 8 7 7 6 6 6 6 6 6 6 6 6 6 6 1 1 1 1 1 1 1 1 1 1 1 1 1
symmnumber: 1
zpe: 595695.5 jmol-1
zpe.correction: 0.226888 hartree
zpe.thermalcorrener: 0.247020 hartree
zpe.thermalcorrenthalpy: 0.247965 hartree
zpe.thermalcorrgfe: 0.173033 hartree
zpe.sumelectzpe: -1172.294869 hartree
zpe.sumelectthermal: -1172.274737 hartree
zpe.sumelectthermalent: -1172.273793 hartree
zpe.sumelectthermalfe: -1172.348724 hartree
dipole: 2.4805 0.4946 -2.6082
dipole: 3.6332
quadrupole: -98.4551 -101.8152 -122.7618
quadrupole: -25.8812 -1.4722 -8.2146
quadrupole: 9.2223 5.8621 -15.0845 -25.8812 -1.4722 -8.2146
hfenergy: -1172.5217571 hartree
pointgroup: C01 [X(C11H13Br1N2O3S1)]
dipole: 0.879806 -0.4053825 -1.051105 debye
polarizability: 230.3366002|-26.9007038|210.185477|-7.7996697|8.0858286|105.691415 unknown
InChI: InChI=1S/C11H13BrN2O3S/c1-16-10(15)5-17-9-3-2-8(12)4-7(9)6-18-11(13)14/h2-4,13H,5-6,14H2,1H3
charge 0 multiplicity 1
31 atoms
Br -4.855948 1.015486 0.026729
S  1.255226 2.637122 -0.376711
O  0.970383 -1.022365 0.118244
O  3.14597 -3.810369 -0.612523
O  3.567147 -1.857689 0.600504
N  0.591784 5.120991 -1.143721
N  -0.691895 4.245122 0.728817
C  -0.639286 0.695048 0.515936
C  -0.381079 -0.632805 0.066261
C  0.477649 1.57653 1.008235
C  -1.972679 1.16843 0.499281
C  -1.430586 -1.46406 -0.390064
C  -3.009831 0.332869 0.04226
C  -2.758525 -0.977855 -0.402867
C  1.294446 -2.381823 -0.275313
C  2.784928 -2.59396 -0.025347
C  0.224147 4.168615 -0.198625
C  4.562727 -4.214751 -0.429587
H  0.114654 2.321566 1.734206
H  1.325438 0.997702 1.401381
H  -2.155481 2.196016 0.828484
H  -1.24172 -2.482788 -0.740722
H  -3.573262 -1.616322 -0.755676
H  0.726923 -3.124089 0.324292
H  1.075587 -2.562563 -1.346195
H  0.111328 6.017647 -1.182403
H  1.328163 4.93503 -1.822583
H  5.232218 -3.461689 -0.877273
H  4.647333 -5.180022 -0.947044
H  4.794011 -4.315519 0.64402
H  -1.207567 5.143393 0.774603
