program: Gaussian 09
title: 000289159
version: EM64L-G09RevD.01
frameworkgroup: C1[X(C13H10N2)]
method: RPBEPBE
basis: SDD
operation: Freq
keyword: #pfreq=noraman
keyword: PBEPBE/SDD
title: #p freq=noraman PBEPBE/SDD
converged: YES YES NO NO
title: Mulliken charges:
elementType: N N C C C C C C C C C C C C C H H H H H H H H H H
charge: -0.696892 0.000649 0.247626 0.123378 0.253131 0.577822 0.354138 -0.794602 -0.388642 -0.366930 -0.481918 -0.383219 -0.255896 -0.270113 -0.374456 0.222134 0.232423 0.196756 0.237750 0.233960 0.232285 0.230887 0.237795 0.317300 0.314632
chargesum: 0.00000
title: Mulliken charges with hydrogens summed into heavy atoms:
elementType: N N C C C C C C C C C C C C C
charge: -0.064959 0.000649 0.247626 0.123378 0.253131 0.577822 0.354138 -0.572468 -0.156218 -0.170175 -0.244169 -0.149259 -0.023611 -0.039226 -0.136660
polarizability: 2.48526837e+02 -7.21063356e-01 1.79009757e+02 -1.13041701e-02 1.23915477e-02 5.96106422e+01
1716.lowfreq: -11.7755 -9.5854 -0.0006 -0.0003 0.0005 7.8098 76.0062 91.0557 138.2964
frequency: 76.0025 91.0557 138.2961 231.3812 240.6757 295.7742 304.7302 316.3239 404.0516 411.4554 412.8838 420.3674 452.9018 497.8094 522.3068 547.6759 589.0741 628.8378 642.2277 644.9414 715.8560 740.3202 774.7676 778.6544 797.6613 825.6259 869.5430 874.8492 893.6794 927.1123 948.3686 964.9973 972.5932 988.6146 1036.9684 1046.6667 1051.1908 1110.2714 1145.8040 1175.9367 1186.4307 1212.7420 1252.3700 1288.4355 1303.1390 1349.4041 1354.3615 1389.5752 1421.1725 1421.9911 1439.5953 1459.4422 1488.7964 1517.6240 1563.2615 1584.8342 1614.5535 1628.6945 1649.4189 3118.7549 3121.7267 3124.4613 3126.3188 3137.6885 3151.3762 3155.6272 3170.3414 3575.8016 3714.4618
redmass: 3.6096 4.1538 3.8218 3.6707 5.1941 3.2349 1.3407 3.5159 6.4547 2.5275 1.6934 7.1331 1.8396 6.5582 2.7692 3.6920 4.0060 6.9018 2.9329 6.6685 5.7184 2.1384 2.1139 5.5092 1.5845 1.4017 1.6464 4.1311 1.7396 2.1584 1.4086 1.4607 7.5271 1.3503 1.7181 2.9908 2.2975 2.1649 2.5202 1.6013 1.1256 1.4586 1.5897 1.7881 2.5921 4.0131 1.9270 3.8156 3.0856 3.0861 2.3547 3.1396 3.0941 4.1782 6.4449 5.6098 5.4541 4.5687 1.3364 1.0904 1.0863 1.0893 1.0872 1.0887 1.0986 1.0939 1.0990 1.0457 1.1026
irintensity: 0.3001 1.1852 9.1592 0.0700 0.1631 0.6426 53.8591 2.0683 0.5096 58.5991 104.0908 0.1670 44.7818 1.0058 2.2995 1.1693 28.1022 1.5054 5.5715 15.4330 1.1241 44.0485 56.7352 2.6666 0.0725 6.7411 35.0184 1.6107 37.0183 7.7187 2.2288 1.4938 11.3367 0.1771 5.7629 5.8231 1.2505 6.3988 1.7737 0.3460 1.7373 23.6877 6.4101 12.9980 31.4213 26.5375 23.6200 6.8429 9.1871 16.8577 2.5112 45.8117 9.0340 45.3226 8.0297 29.7223 92.5348 53.1799 339.9790 12.5611 14.3644 21.3374 10.4571 8.3061 44.2866 30.9905 24.8531 78.3480 23.8265
temp: 298.150 k
press: 1.00000 atm
elementType: 7 7 6 6 6 6 6 6 6 6 6 6 6 6 6 1 1 1 1 1 1 1 1 1 1
symmnumber: 1
zpe: 514577.6 jmol-1
zpe.correction: 0.195992 hartree
zpe.thermalcorrener: 0.207157 hartree
zpe.thermalcorrenthalpy: 0.208101 hartree
zpe.thermalcorrgfe: 0.159240 hartree
zpe.sumelectzpe: -609.895409 hartree
zpe.sumelectthermal: -609.884244 hartree
zpe.sumelectthermalent: -609.883300 hartree
zpe.sumelectthermalfe: -609.932161 hartree
dipole: 4.3851 3.7983 0.0050
dipole: 5.8014
quadrupole: -82.3627 -70.2558 -94.1198
quadrupole: -5.5052 0.0138 0.0285
quadrupole: -0.1166 11.9903 -11.8737 -5.5052 0.0138 0.0285
hfenergy: -610.0914012 hartree
pointgroup: C01 [X(C13H10N2)]
dipole: 1.6820269 -1.5428208 -0.0019816 debye
dipolederiv: -0.7440757 0.6535212 0.0003662 0.8134136 -1.1052553 0.0017528 -0.0008362 0.0031447 -0.6969193 -0.7218844 0.0179796 -0.0000773 0.0268945 -0.435508 0.0000041 -0.0001425 0.0000165 -0.2577424 0.3705826 0.0625238 0.0002317 -0.0298875 -0.0215866 0.0000444 0.0006701 0.0001351 0.0466532 -0.1925928 0.0387556 -0.0000544 0.3045941 -0.3992314 0.0001628 -0.0000741 0.0002447 -0.0141434 0.0480764 -0.0165965 -0.0001946 0.3900136 -0.1949094 -0.000078 0.0003537 -0.0006547 -0.0078083 0.4115955 -0.3666782 0.0002658 -0.5230655 0.3755779 -0.0002242 0.0003677 -0.00024 0.1079976 0.864771 -0.8484393 0.0004637 -0.7103924 1.0551166 -0.0009807 -0.0000381 -0.0009684 0.1401813 -0.6612736 0.613861 -0.0004575 0.1270565 -0.1315428 -0.0002787 -0.0007151 0.0000745 -0.3025936 -0.0996466 -0.094372 -0.0001761 -0.0922368 0.0531648 0.0001753 -0.0002985 0.0000662 -0.1378745 -0.0331723 -0.035996 -0.0003078 -0.1279555 0.0325631 0.0004807 -0.000596 0.000781 -0.1711979 0.4185077 -0.0918755 0.0001526 -0.1623382 0.3370854 -0.0001073 -0.000107 -0.0001882 -0.0640922 -0.3026877 0.2559325 -0.0000911 0.2461036 -0.0168591 0.0001622 0.0000276 -0.0000273 -0.1619973 -0.039624 0.0415817 0.0000137 0.0182397 0.1197456 0.0002827 0.0002142 0.0004194 -0.1592577 0.0739112 -0.0234191 -0.000449 0.0023115 -0.0847165 0.0000651 -0.0005507 -0.0000684 -0.1597291 0.3903506 0.0511772 0.0002523 0.0074684 0.2678942 -0.0000386 0.0003709 0.0000336 -0.1067457 0.0306603 -0.0757894 0.0000809 -0.0363573 -0.1225364 0.0002139 0.0000403 0.0003969 0.1700421 0.0416168 0.120416 0.0001757 0.0563512 -0.0164952 -0.0001809 -0.0000052 -0.0002087 0.1436136 0.012314 0.0819189 0.0002909 0.1467863 -0.0886218 -0.0003679 0.0005342 -0.0003444 0.152344 0.0587081 -0.1041749 -0.0000181 -0.0718599 -0.0737937 0.0000119 0.0000765 0.0000209 0.1146378 0.0474782 -0.0350904 -0.0000504 -0.1224959 -0.095886 -0.0000518 -0.0000553 -0.0000198 0.1562569 0.041522 -0.0779715 -0.0000064 -0.0995218 -0.0894602 -0.0002042 -0.0000583 -0.000224 0.1608147 -0.1395213 -0.0296749 0.0003012 -0.0183874 0.0870121 -0.0000556 0.0004242 -0.0000371 0.1623801 -0.1590443 -0.0452322 -0.000144 -0.0293844 0.0867126 -0.0000083 -0.0002778 0.0000087 0.1464478 0.108998 -0.0438694 -0.000504 -0.0719007 0.2216138 -0.0004413 0.0005234 -0.0016531 0.3754086 0.1744303 -0.0484883 -0.0000641 -0.0434498 0.2399161 -0.0003385 0.0001521 -0.0007081 0.3633238 unknown
polarizability: 248.5116072|-1.2563578|179.0249869|0.011652|0.012065|59.6106422 unknown
InChI: InChI=1S/C13H10N2/c14-13-7-9-5-6-15-8-12(9)10-3-1-2-4-11(10)13/h1-8H,14H2
charge 0 multiplicity 1
25 atoms
N  1.608237 -2.983128 0.001308
N  -3.153964 1.48098 -0.000759
C  0.568426 0.654191 0.000654
C  -0.887306 0.502368 0.000361
C  1.414757 -0.515063 -0.000112
C  -1.446416 -0.827113 -0.000009
C  0.802573 -1.848618 0.000607
C  -0.58825 -1.97311 0.000591
C  1.193919 1.939532 0.001395
C  2.833611 -0.344903 -0.001432
C  -1.803473 1.598473 -0.000081
C  -2.872891 -0.949453 -0.000618
C  2.587017 2.08143 0.000745
C  3.417785 0.927961 -0.001008
C  -3.66831 0.199804 -0.000886
H  -1.045125 -2.970613 0.001493
H  0.573993 2.840551 0.002465
H  3.501814 -1.213412 -0.003381
H  -1.436311 2.630666 -0.000162
H  -3.336194 -1.942207 -0.000891
H  3.036342 3.080225 0.001486
H  4.507787 1.033987 -0.002198
H  -4.761842 0.132709 -0.001504
H  1.182479 -3.905621 -0.00206
H  2.620343 -2.928936 0.001699
