program: Gaussian 09
title: 000289149
version: EM64L-G09RevD.01
frameworkgroup: C1[X(C7H12O)]
method: RPBEPBE
basis: SDD
operation: Freq
keyword: #pfreq=noraman
keyword: PBEPBE/SDD
title: #p freq=noraman PBEPBE/SDD
converged: YES YES NO NO
title: Mulliken charges:
elementType: O C C C C C C C H H H H H H H H H H H H
charge: -0.448938 -0.144832 -0.136761 -0.503167 -0.505114 -0.076526 -0.418373 -0.476063 0.255627 0.229831 0.220910 0.221502 0.211622 0.219468 0.188968 0.195581 0.216944 0.226067 0.193854 0.329399
chargesum: 0.00000
title: Mulliken charges with hydrogens summed into heavy atoms:
elementType: O C C C C C C C
charge: -0.119540 0.110795 0.093071 -0.060755 -0.074024 0.112442 -0.005848 -0.056142
polarizability: 7.82000522e+01 -1.50458006e+00 7.23602037e+01 -6.19623772e-01 -5.43760565e-01 6.68153568e+01
1716.lowfreq: -22.6368 -1.1662 -0.0008 -0.0007 -0.0004 27.5736 137.9915 230.5442 284.4580
frequency: 137.9263 230.5390 284.4577 323.4935 378.8904 405.4880 429.6362 531.1166 553.2699 758.1109 809.6394 814.9139 821.7008 885.6265 911.0395 924.5604 934.2735 946.8517 973.8623 1024.5573 1033.6249 1075.4891 1079.8857 1094.9567 1099.2101 1127.2436 1186.5566 1198.3045 1216.4773 1232.3429 1240.6193 1257.8375 1290.6998 1306.4721 1312.6060 1326.5753 1349.2857 1386.1600 1457.2669 1472.8083 1474.3110 1494.6434 2934.8721 2975.5428 2992.2599 2997.8488 3019.0591 3026.7153 3046.0445 3051.9542 3068.1598 3078.3578 3092.5060 3552.8758
redmass: 3.0715 1.8830 1.1253 3.0798 2.3303 2.1687 4.4285 3.3936 2.1972 2.0614 2.3320 2.3276 1.7953 2.9117 2.0501 1.9346 2.0212 2.0048 3.1504 1.8525 1.1463 1.7405 2.7999 1.3710 1.2186 1.2536 1.2491 1.2931 1.5676 1.4206 1.4869 1.4830 1.3035 1.7191 1.3940 1.3802 1.4428 1.6280 1.0866 1.0973 1.0834 1.0999 1.0849 1.0594 1.0618 1.0599 1.0616 1.1002 1.0897 1.1028 1.0942 1.1024 1.1067 1.0660
irintensity: 2.7899 12.6807 128.9820 11.5968 1.7440 1.3705 1.4351 8.9711 1.8631 1.2783 3.7626 0.1564 1.8700 6.7363 3.5468 6.1988 2.4523 12.1311 86.8675 0.8746 0.3856 1.8228 11.2369 1.7687 0.4889 11.9019 2.1349 20.3836 14.9761 3.2974 4.3863 11.2910 0.4324 1.6419 0.4724 1.7224 10.1183 1.5362 3.9067 11.1195 13.1409 2.3768 60.6373 36.0057 55.8019 56.6970 35.2915 21.5649 74.1400 59.3742 22.2726 48.4861 50.6195 2.2718
temp: 298.150 k
press: 1.00000 atm
elementType: 8 6 6 6 6 6 6 6 1 1 1 1 1 1 1 1 1 1 1 1
symmnumber: 1
zpe: 464327.7 jmol-1
zpe.correction: 0.176853 hartree
zpe.thermalcorrener: 0.183975 hartree
zpe.thermalcorrenthalpy: 0.184919 hartree
zpe.thermalcorrgfe: 0.146019 hartree
zpe.sumelectzpe: -348.484273 hartree
zpe.sumelectthermal: -348.477151 hartree
zpe.sumelectthermalent: -348.476207 hartree
zpe.sumelectthermalfe: -348.515108 hartree
dipole: 0.5141 1.5881 -0.9001
dipole: 1.8964
quadrupole: -48.6136 -49.2120 -49.6795
quadrupole: -5.1592 2.3123 0.3036
quadrupole: 0.5547 -0.0436 -0.5111 -5.1592 2.3123 0.3036
hfenergy: -348.6611262 hartree
pointgroup: C01 [X(C7H12O1)]
dipole: 0.1842835 0.6299028 -0.3548761 debye
dipolederiv: -0.8263312 -0.2249188 0.111458 -0.2665467 -0.3295172 -0.1479999 0.1717941 -0.1233307 -0.4801047 -0.0199639 0.1039922 0.0181747 0.0574393 0.1476522 -0.00859 0.0336547 0.0190709 0.0095963 0.2195372 -0.0258601 0.0625249 0.0561395 0.0675722 0.0251631 0.0352192 0.0058482 0.0315034 -0.0068614 -0.1012843 -0.0494516 -0.0927463 0.0273569 0.0142405 -0.0775642 0.0638885 0.0247813 -0.0489854 -0.1003201 -0.008782 -0.0775114 0.0071283 -0.0648434 0.0310403 -0.1134485 0.0964947 0.7309785 0.1009421 -0.0883011 0.0689746 0.2861911 0.0632273 -0.083533 0.0439858 0.4146289 0.0581121 0.0249571 -0.014432 0.0399008 0.065155 0.0134796 -0.0182173 0.0013289 0.1559679 -0.0858711 -0.0678295 0.0253895 -0.1292667 -0.0231866 -0.074835 -0.0086414 -0.0663443 0.0703971 -0.0007769 -0.0967063 -0.0183417 -0.0970189 -0.1330958 -0.0251816 -0.031137 -0.018166 0.0588639 -0.2294871 -0.0494135 -0.0539874 -0.0383086 0.0136793 -0.0105976 -0.0536054 -0.0098426 0.0512005 -0.007573 0.1168491 -0.064152 0.1092666 -0.1000535 0.1001564 -0.0373438 0.0592059 0.027563 0.0287873 0.0227044 0.1135119 0.029431 0.0356548 -0.1087831 0.0741081 -0.0590883 -0.115777 0.0619758 0.0077208 -0.0440077 -0.0075758 0.0327103 0.11807 0.0056828 0.0549441 -0.1881338 -0.0376009 0.1295263 0.0373238 0.1376168 -0.1018642 -0.0457593 0.0077062 -0.0061017 0.0637308 -0.0519902 -0.0155219 -0.02673 -0.0046415 0.0014373 0.0161031 -0.0294206 -0.0072762 -0.2504398 0.0059413 -0.0147329 0.0501212 -0.025285 0.0046575 0.0704543 0.0911774 0.1379103 -0.1265727 0.0102479 -0.0543184 -0.0355818 -0.0533155 -0.088209 -0.1048532 -0.0686157 -0.1558262 -0.0352205 0.0302273 -0.0069168 0.0436967 -0.0212192 0.0657776 0.0060575 0.0695036 -0.0466409 -0.1167133 -0.0335973 0.1138805 -0.0559771 0.1003354 -0.097081 0.0701719 -0.0850671 0.1077223 0.0229992 0.2032311 0.1372502 -0.0024562 0.2143314 0.1180348 0.0943192 -0.0267407 0.1121604 0.2852349 unknown
polarizability: 78.2268912|-1.4033491|72.3115906|-0.8246941|-0.5060437|66.8371308 unknown
InChI: InChI=1S/C7H12O/c8-7-2-1-5-3-6(7)4-5/h5-8H,1-4H2
charge 0 multiplicity 1
20 atoms
O  -2.399574 -0.421531 0.25624
C  -0.106378 -1.116773 -0.135951
C  1.591106 0.169646 0.183382
C  0.736071 -0.747344 1.137861
C  1.182726 -0.806246 -0.977798
C  -1.15473 -0.033072 -0.445404
C  0.886449 1.532195 -0.032996
C  -0.664794 1.365209 0.029873
H  -0.559953 -2.118137 -0.201369
H  2.66567 0.292285 0.399427
H  1.319109 -1.614415 1.49403
H  0.21291 -0.284537 1.990878
H  1.050391 -0.3721 -1.986009
H  1.850583 -1.683193 -1.040676
H  -1.344139 -0.02811 -1.542273
H  1.202506 1.945731 -1.011363
H  1.201435 2.260252 0.73934
H  -0.98797 1.458745 1.08403
H  -1.169259 2.173947 -0.533704
H  -3.093958 0.262347 0.075581
