program: Gaussian 09
title: 000289160
version: EM64L-G09RevD.01
frameworkgroup: C1[X(C9H12N2O6)]
method: RPBEPBE
basis: SDD
operation: Freq
keyword: #p
keyword: freq=noraman
keyword: PBEPBE/SDD
title: #p freq=noraman PBEPBE/SDD
converged: YES YES NO NO
title: Mulliken charges:
elementType: O O O O O O N N C C C C C C C C C H H H H H H H H H H H H
charge: -0.284315 -0.421251 -0.428943 -0.438861 -0.256823 -0.251913 -0.226631 -0.368453 -0.234448 -0.133827 -0.074308 -0.044058 -0.345294 0.247589 0.269782 -0.275308 -0.148051 0.324335 0.201698 0.260012 0.287366 0.182273 0.236439 0.338634 0.356211 0.353280 0.354014 0.261787 0.259064
chargesum: 0.00000
title: Mulliken charges with hydrogens summed into heavy atoms:
elementType: O O O O O O N N C C C C C C C C C
charge: -0.284315 -0.082617 -0.072732 -0.085581 -0.256823 -0.251913 -0.226631 -0.014439 0.089887 0.067870 0.185704 0.243308 0.073419 0.247589 0.269782 -0.013521 0.111013
polarizability: 1.56147695e+02 -4.02881012e+00 1.07407310e+02 -7.87935903e+00 -1.80729287e+01 1.18259242e+02
1716.lowfreq: -5.4511 -0.0004 0.0006 0.0008 2.9857 7.3045 44.1536 55.0313 57.3471
frequency: 44.1175 55.0282 57.3432 85.8385 92.6625 145.9321 161.9253 173.1032 187.6540 212.2527 243.4873 287.2926 309.7626 314.8013 359.0707 364.9939 398.5949 432.5290 443.1434 446.9461 503.0345 522.9521 529.0607 542.1026 557.5535 580.7120 633.7525 645.7365 703.9296 725.7585 744.6469 803.3443 807.4930 853.7323 926.2458 949.3832 956.3423 980.4471 1001.3250 1012.3346 1039.9345 1046.8008 1057.5079 1061.9614 1084.2412 1096.4494 1120.5400 1163.9690 1181.7694 1189.2006 1223.8002 1227.9022 1256.2041 1272.9017 1289.5731 1311.7231 1324.2913 1339.1447 1353.4391 1369.3291 1374.9923 1382.1320 1400.7304 1409.4844 1449.4629 1457.1678 1593.7248 1645.0555 1667.1665 2913.4911 2952.3747 3026.9598 3054.2424 3087.4194 3104.9869 3179.0990 3220.3550 3536.8130 3548.9411 3556.8895 3557.7372
redmass: 7.2567 6.2737 6.4764 6.1507 5.8872 5.6536 3.1948 5.6978 8.1817 4.1955 6.0899 2.4978 1.9243 3.2905 4.4129 1.1803 4.9367 3.6267 1.7465 2.2820 4.6179 8.0450 5.4157 6.1597 5.4957 3.7014 1.7000 3.7353 2.0978 6.8927 6.3955 2.0370 2.3886 6.1241 4.6630 1.2909 8.0499 3.5172 2.8159 4.5895 4.0899 2.6015 3.4551 2.4371 3.7254 3.9334 2.1677 2.3130 1.3346 1.3158 1.3610 1.3462 1.2140 1.2740 1.2953 1.2613 2.2281 1.3416 1.3955 1.5175 1.2209 1.2971 1.5781 1.6751 2.5825 1.0858 6.5443 7.8265 6.0401 1.0824 1.0691 1.0850 1.0851 1.0947 1.0865 1.0921 1.0982 1.0659 1.0657 1.0662 1.0785
irintensity: 3.0702 6.6660 2.4392 0.0339 8.4728 0.2635 0.9455 0.4152 0.5546 5.6092 17.8271 15.8573 16.1795 17.4700 15.8381 255.8889 2.0291 33.7335 90.3702 90.8256 4.4372 8.5238 8.9541 24.4561 11.2294 7.8657 32.5241 27.6344 60.2758 5.9644 19.8625 22.1600 74.5908 26.0775 69.5024 0.2016 247.2951 8.9818 68.9516 7.7345 23.6337 44.9744 10.7063 10.7175 107.8874 22.3678 9.7521 58.0888 1.4720 49.1164 25.8046 22.0683 14.6574 12.7120 32.6399 21.8091 165.1331 34.9968 13.9988 7.0870 10.4745 26.4663 54.8291 12.5502 38.0534 5.4671 186.3301 466.4305 200.8720 46.6968 70.3829 16.6350 6.8089 18.7704 1.4851 4.6914 1.8553 9.0037 9.6899 11.9091 93.4424
temp: 298.150 k
press: 1.00000 atm
elementType: 8 8 8 8 8 8 7 7 6 6 6 6 6 6 6 6 6 1 1 1 1 1 1 1 1 1 1 1 1
symmnumber: 1
zpe: 573766.5 jmol-1
zpe.correction: 0.218536 hartree
zpe.thermalcorrener: 0.234590 hartree
zpe.thermalcorrenthalpy: 0.235535 hartree
zpe.thermalcorrgfe: 0.174876 hartree
zpe.sumelectzpe: -909.697084 hartree
zpe.sumelectthermal: -909.681029 hartree
zpe.sumelectthermalent: -909.680085 hartree
zpe.sumelectthermalfe: -909.740744 hartree
dipole: 4.6168 0.9655 1.2263
dipole: 4.8735
quadrupole: -84.3242 -103.9485 -103.1925
quadrupole: -23.8667 14.5475 -3.8434
quadrupole: 12.8309 -6.7934 -6.0374 -23.8667 14.5475 -3.8434
hfenergy: -909.9156198 hartree
pointgroup: C01 [X(C9H12N2O6)]
dipole: 1.8457303 -0.1622945 -0.4932055 debye
polarizability: 155.0418888|5.9536811|114.5592964|10.8971738|-18.049842|112.2130616 unknown
InChI: InChI=1S/C9H12N2O6/c12-3-4-6(14)7(15)8(17-4)11-5(13)1-2-10-9(11)16/h1-2,4,6-8,10,12,14-15H,3H2
charge 0 multiplicity 1
29 atoms
O  -1.132943 0.407974 0.921796
O  -0.587659 -2.86128 -0.651839
O  -3.168677 -1.201807 -1.666211
O  -3.306836 2.220017 1.331976
O  0.222834 1.176599 -1.64814
O  2.104758 -1.252265 1.943345
N  1.132691 -0.047084 0.15833
N  2.469973 1.450214 -1.11075
C  -0.877846 -1.430813 -0.64692
C  -2.375919 -1.085126 -0.453448
C  -0.184984 -0.634544 0.496863
C  -2.331392 0.378606 0.008521
C  -3.5150 0.855005 0.844249
C  1.197428 0.87178 -0.909702
C  2.256256 -0.41242 1.011445
C  3.513329 0.255232 0.68947
C  3.585896 1.155272 -0.342743
H  -0.561706 -1.079395 -1.640016
H  -2.790246 -1.729922 0.3585
H  0.027898 -1.281334 1.368046
H  -2.139789 1.046546 -0.849973
H  -3.679255 0.1496 1.688096
H  -4.422157 0.892171 0.218939
H  -0.746836 -3.242553 0.250418
H  -3.064209 -2.119201 -2.026901
H  -2.423111 2.240772 1.782473
H  2.512336 2.117383 -1.883728
H  4.382108 0.012618 1.301075
H  4.509659 1.675153 -0.608568
