program: Gaussian 09
title: 000289150
version: EM64L-G09RevD.01
frameworkgroup: C1[X(C14H18O3S)]
method: RPBEPBE
basis: SDD
operation: Freq
keyword: #p
keyword: freq=noraman
keyword: PBEPBE/SDD
title: #p freq=noraman PBEPBE/SDD
converged: YES YES NO NO
title: Mulliken charges:
elementType: S O O O C C C C C C C C C C C C C C H H H H H H H H H H H H H H H H H H
charge: 0.967407 -0.424645 -0.504426 -0.519321 -0.181586 -0.121171 -0.493932 -0.070191 -0.512074 -0.445344 -0.462593 -0.023886 -0.239900 -0.245461 -0.359760 -0.360054 0.452118 -0.797894 0.261856 0.233597 0.224335 0.225905 0.283289 0.228890 0.237893 0.222767 0.232941 0.206184 0.223106 0.280915 0.283821 0.245015 0.245352 0.230903 0.244818 0.231121
chargesum: 0.00000
title: Mulliken charges with hydrogens summed into heavy atoms:
elementType: S O O O C C C C C C C C C C C C C C
charge: 0.967407 -0.424645 -0.504426 -0.519321 0.080270 0.112427 -0.043691 0.213098 -0.045291 0.010364 -0.033303 -0.023886 0.041015 0.038360 -0.114744 -0.114701 0.452118 -0.091052
polarizability: 2.47697999e+02 -1.56851608e+01 1.43755516e+02 1.24014432e+00 -3.90050296e+00 1.65966137e+02
1716.lowfreq: -30.8094 -9.9167 -7.5499 -0.0022 -0.0022 -0.0015 8.9485 12.5587 30.0661
frequency: -30.5647 10.5964 29.9362 35.7764 47.8149 89.0612 122.0046 132.5756 140.2071 207.1053 227.9491 258.2756 274.1422 295.4385 321.8228 366.6102 384.8300 392.4766 407.3942 421.3102 442.2797 487.9650 515.4165 535.7922 570.5013 596.4675 621.3305 704.4180 731.0222 755.4765 778.4159 799.8617 804.8615 822.3563 828.3497 832.7766 848.3449 880.0695 916.1151 925.4005 943.7495 949.4678 951.6655 962.5487 965.1609 978.7937 982.2507 991.2686 994.3653 1015.0332 1048.9174 1052.6920 1055.1705 1079.6345 1111.3234 1116.6327 1119.5536 1139.3352 1173.7934 1185.0720 1201.9237 1218.9541 1233.7905 1245.5407 1260.4254 1271.5526 1288.4411 1296.1831 1297.3313 1305.0675 1321.8574 1335.4540 1382.3661 1392.5428 1398.9951 1460.2961 1467.1902 1468.3676 1470.5990 1473.0260 1474.0301 1490.3329 1595.3144 1596.0519 2981.6668 2997.7284 3001.6188 3004.1595 3015.7376 3020.9488 3055.3977 3061.8339 3064.3754 3073.3557 3077.5613 3079.4360 3092.8693 3093.7210 3138.0353 3139.6781 3164.5034 3167.3705
redmass: 1.0209 3.9454 3.6719 4.6053 5.3692 3.6561 5.3894 4.8309 5.9528 5.0504 7.9173 2.9140 4.0952 4.8551 4.4395 2.6260 3.6222 4.7665 2.8597 2.1497 4.2424 3.7900 3.7360 5.2263 5.8695 6.4009 6.9589 3.3185 3.7411 2.6766 4.9247 1.4764 3.2708 3.0870 1.8900 2.6737 1.2452 2.5535 2.9881 2.5510 1.7304 7.2931 2.1274 1.3043 1.8354 1.9225 1.3991 1.4164 5.3822 2.3937 1.5976 1.5938 2.4539 1.6255 1.0958 1.1437 1.2840 1.6656 1.4914 1.1404 1.3684 3.0332 1.3839 1.5962 1.3889 1.3728 1.4984 1.4695 1.2648 1.5582 1.4848 1.3250 6.3100 2.9632 1.2183 1.0818 1.0923 1.0817 1.1035 1.9319 1.1754 1.0971 6.0556 6.9448 1.0390 1.0600 1.0756 1.0601 1.0705 1.0647 1.1018 1.0902 1.0947 1.1040 1.1003 1.0960 1.1023 1.1001 1.0893 1.0894 1.0955 1.0969
irintensity: 0.6865 1.1253 0.0454 1.3234 0.1646 0.4886 3.5560 1.7633 1.4418 4.0173 8.7767 0.0417 3.4553 10.0990 8.0948 2.4004 3.4668 8.8232 0.0328 11.1767 68.0844 13.2740 35.1798 50.2849 44.1660 81.3239 0.1988 0.6390 0.1885 2.5842 2.5659 11.4443 16.2968 98.5789 12.2146 23.1553 0.1817 1.9716 4.8598 5.1315 2.0392 67.2605 20.8289 0.5576 14.0104 25.9327 0.6507 2.9399 2.0426 0.8712 26.2009 13.8011 23.9834 45.2964 1.6918 7.4574 8.0465 12.0912 3.3540 11.0632 2.7152 6.8530 7.6784 2.3018 1.7625 0.2984 4.6110 5.1191 2.8399 2.2523 3.7724 28.1618 0.4178 10.6005 16.4504 6.6773 13.6687 8.6940 17.5006 20.7869 15.9861 8.8522 12.7304 0.4549 23.0960 43.8748 1.2761 47.6190 30.4923 44.9891 19.3936 61.9412 18.4448 25.1712 26.0225 25.1016 47.5752 14.5301 13.1678 7.0410 0.5006 9.7368
temp: 298.150 k
press: 1.00000 atm
elementType: 16 8 8 8 6 6 6 6 6 6 6 6 6 6 6 6 6 6 1 1 1 1 1 1 1 1 1 1 1 1 1 1 1 1 1 1
symmnumber: 1
zpe: 762946.0 jmol-1
zpe.correction: 0.290591 hartree
zpe.thermalcorrener: 0.307359 hartree
zpe.thermalcorrenthalpy: 0.308303 hartree
zpe.thermalcorrgfe: 0.243365 hartree
zpe.sumelectzpe: -1166.490822 hartree
zpe.sumelectthermal: -1166.474053 hartree
zpe.sumelectthermalent: -1166.473109 hartree
zpe.sumelectthermalfe: -1166.538048 hartree
dipole: 2.9109 -3.9230 -1.0721
dipole: 5.0013
quadrupole: -84.5084 -125.1809 -112.2373
quadrupole: -4.6381 1.3465 -1.7643
quadrupole: 22.8005 -17.8720 -4.9285 -4.6381 1.3465 -1.7643
hfenergy: -1166.7814123 hartree
pointgroup: C01 [X(C14H18O3S1)]
dipole: 1.1299633 0.9968883 1.2653421 debye
polarizability: 247.5144858|13.3439534|155.0896729|9.5122212|-11.599718|154.8154931 unknown
InChI: InChI=1S/C14H18O3S/c1-10-2-6-13(7-3-10)18(15,16)17-14-9-11-4-5-12(14)8-11/h2-3,6-7,11-12,14H,4-5,8-9H2,1H3
charge 0 multiplicity 1
36 atoms
S  0.229627 -0.963752 -0.977786
O  -0.807828 0.039767 0.221071
O  -0.050522 -0.464551 -2.49577
O  0.061925 -2.531564 -0.583539
C  -3.183723 -0.351691 -0.682594
C  -4.110691 0.782741 1.074616
C  -4.505877 -0.403117 0.142681
C  -2.148611 -0.539837 0.465801
C  -2.762077 0.271921 1.662857
C  -3.163008 1.126878 -1.163517
C  -3.804456 1.909443 0.042366
C  1.897777 -0.332349 -0.410729
C  2.539632 -1.009289 0.637922
C  2.441828 0.782716 -1.066308
C  3.802389 -0.530068 1.048133
C  3.705443 1.241577 -0.634184
C  4.400559 0.597451 0.423841
C  5.770645 1.084048 0.857805
H  -3.078951 -1.09238 -1.491226
H  -4.847152 1.065661 1.844714
H  -4.652241 -1.355154 0.685961
H  -5.399647 -0.200996 -0.473701
H  -2.024697 -1.612547 0.709307
H  -2.090995 1.096185 1.961659
H  -2.912259 -0.382461 2.539904
H  -3.766989 1.232104 -2.082276
H  -2.138932 1.461106 -1.395622
H  -3.120909 2.670581 0.460109
H  -4.73354 2.425892 -0.261593
H  2.07515 -1.883591 1.104536
H  1.903121 1.262806 -1.889182
H  4.327957 -1.037612 1.864894
H  4.155112 2.111824 -1.125419
H  5.956601 0.875062 1.925412
H  6.567817 0.577435 0.280001
H  5.887119 2.169362 0.694653
