program: Gaussian 09
title: 000289136
version: EM64L-G09RevD.01
frameworkgroup: C1[X(C16H13NS)]
method: RPBEPBE
basis: SDD
operation: Freq
keyword: #p
keyword: freq=noraman
keyword: PBEPBE/SDD
title: #p freq=noraman PBEPBE/SDD
converged: YES YES NO NO
title: Mulliken charges:
elementType: S N C C C C C C C C C C C C C C C C H H H H H H H H H H H H H
charge: 0.200036 -0.488027 0.315336 -0.634529 0.134847 0.158912 0.489247 0.200812 -0.416607 -0.639404 -0.422305 -0.362895 -0.385840 -0.268553 -0.252977 -0.222034 -0.260127 -0.244046 0.265585 0.311290 0.231334 0.222978 0.239742 0.232142 0.231984 0.212810 0.246036 0.221415 0.222336 0.228902 0.231600
chargesum: 0.00000
title: Mulliken charges with hydrogens summed into heavy atoms:
elementType: S N C C C C C C C C C C C C C C C C
charge: 0.200036 -0.176738 0.315336 -0.368944 0.134847 0.158912 0.489247 0.200812 -0.416607 0.054650 -0.190163 -0.130911 -0.173030 -0.022517 -0.031562 0.000302 -0.031225 -0.012446
polarizability: 3.33936594e+02 -1.79576449e+01 2.03273356e+02 -1.04230390e+00 -8.93944031e+00 9.42126524e+01
1716.lowfreq: -6.5504 0.0011 0.0014 0.0018 5.3082 12.4584 47.8585 59.9603 102.2602
frequency: 47.7670 59.9409 102.2511 125.0670 143.8839 210.5074 225.0643 229.0738 252.2248 289.5180 304.9265 357.6178 394.8856 417.1419 426.0963 433.1374 466.3022 505.1307 509.0306 535.3604 563.8924 579.1200 599.1921 640.5951 667.1912 690.5365 695.0607 731.3324 744.3578 748.9201 760.7551 772.6841 820.0030 850.2730 862.8707 895.6778 930.7981 939.3893 967.3434 970.9305 977.8785 1007.1421 1010.8739 1030.5125 1038.7552 1065.4434 1077.9087 1113.9035 1125.3101 1165.8475 1174.0468 1191.1421 1218.0478 1242.2996 1253.6384 1275.6596 1284.1236 1322.6601 1355.8443 1369.0946 1386.0267 1408.3432 1420.6691 1427.4201 1458.2772 1459.5400 1466.9146 1480.9241 1490.9279 1555.9190 1578.7170 1589.0279 1601.3228 1629.6096 2977.8769 3029.0207 3074.2282 3095.0228 3115.9289 3124.2143 3131.1804 3134.0054 3145.2478 3147.7254 3163.3816 3166.3225 3610.7362
redmass: 4.0576 4.8900 3.5930 4.5085 4.1582 5.1902 3.3489 1.1105 5.5659 4.6453 4.6027 6.4901 6.3631 3.7536 5.6098 3.6124 3.7041 1.4618 2.5874 3.8014 6.3633 3.9212 5.9438 5.3808 4.6600 4.7510 5.8624 2.7853 2.4897 1.4365 2.5490 2.4361 4.7900 1.4710 1.4524 5.3818 1.3836 1.3966 2.1972 1.3267 1.3327 2.7784 2.0020 4.0765 1.9742 2.0032 2.5067 1.7726 1.6241 1.1054 1.0799 2.3240 1.5411 1.3838 1.6865 1.5342 1.4916 2.6652 2.3497 6.9779 1.2209 3.2848 2.6022 2.3747 1.5391 1.8120 1.1345 2.9126 3.7728 6.3719 6.8696 6.4729 6.7939 7.0643 1.0357 1.0853 1.0985 1.1011 1.0873 1.0850 1.0891 1.0872 1.0951 1.0937 1.1001 1.1006 1.0801
irintensity: 0.4071 0.5207 1.1116 0.1508 0.2506 0.1873 0.1430 0.2821 0.1465 0.7299 3.7169 0.0674 0.9203 1.2184 5.5389 7.8255 1.6640 72.8610 20.9339 3.6644 7.5304 0.2443 5.4300 1.8912 3.5926 0.0828 4.8079 5.7663 19.6402 122.5505 49.8252 6.9482 2.1998 0.0909 0.2747 0.7226 2.4056 1.8878 11.8163 0.3982 0.0179 15.3384 3.8846 23.3763 18.8754 1.7109 4.1411 2.0840 3.1878 2.3077 0.6797 3.8507 6.7204 7.0587 5.9960 11.6321 4.7104 21.7752 11.9364 30.4533 21.4780 38.9759 7.3164 18.1766 42.9539 2.3851 5.3378 4.7971 16.1696 5.2837 2.7653 1.4656 6.7550 0.1827 24.1738 7.2164 19.7760 23.9971 13.2097 2.0452 1.6916 1.1292 31.6749 19.4111 42.7047 31.9796 39.9264
temp: 298.150 k
press: 1.00000 atm
elementType: 16 7 6 6 6 6 6 6 6 6 6 6 6 6 6 6 6 6 1 1 1 1 1 1 1 1 1 1 1 1 1
symmnumber: 1
zpe: 637816.0 jmol-1
zpe.correction: 0.242931 hartree
zpe.thermalcorrener: 0.257227 hartree
zpe.thermalcorrenthalpy: 0.258171 hartree
zpe.thermalcorrgfe: 0.201889 hartree
zpe.sumelectzpe: -1069.109978 hartree
zpe.sumelectthermal: -1069.095682 hartree
zpe.sumelectthermalent: -1069.094738 hartree
zpe.sumelectthermalfe: -1069.151020 hartree
dipole: -0.0893 -1.9393 0.9991
dipole: 2.1833
quadrupole: -103.0493 -96.6564 -120.0140
quadrupole: -3.1046 1.1798 0.5793
quadrupole: 3.5239 9.9168 -13.4408 -3.1046 1.1798 0.5793
hfenergy: -1069.3529091 hartree
pointgroup: C01[X(C16H13N1S1)]
dipole: -0.0027646 -0.7451053 -0.4273849 debye
polarizability: 335.2287008|12.3354988|200.9145786|-2.6005861|13.7063777|95.2793227 unknown
InChI: InChI=1S/C16H13NS/c1-10-15-11-6-2-4-8-13(11)17-16(15)12-7-3-5-9-14(12)18-10/h2-10,17H,1H3
charge 0 multiplicity 1
31 atoms
S  -1.670971 2.164688 0.957755
N  0.692277 -1.526698 -0.030696
C  0.580941 0.751807 0.061816
C  -0.003614 2.137113 0.001862
C  -0.181873 -0.423152 -0.00208
C  1.975388 0.367158 0.073659
C  -1.636821 -0.525787 -0.021419
C  2.0150 -1.074545 0.022543
C  -2.427009 0.599031 0.37754
C  -0.193387 2.663776 -1.43586
C  3.198556 1.088639 0.122478
C  3.227698 -1.796089 0.03558
C  -2.311096 -1.717919 -0.409316
C  -3.836789 0.50578 0.405724
C  4.41082 0.372476 0.13183
C  4.425635 -1.053891 0.090425
C  -3.716211 -1.811835 -0.3709
C  -4.482704 -0.697733 0.045571
H  0.611371 2.84372 0.588168
H  0.401582 -2.500134 0.022118
H  -0.599762 3.690404 -1.430564
H  0.77808 2.668091 -1.966358
H  -0.886991 2.015932 -1.999658
H  3.202316 2.184035 0.157091
H  3.245983 -2.891116 0.001946
H  -1.728675 -2.57629 -0.766777
H  -4.427951 1.377033 0.707583
H  5.362082 0.914412 0.173053
H  5.385871 -1.581434 0.100829
H  -4.211662 -2.740571 -0.672837
H  -5.575883 -0.757399 0.075591
