program: Gaussian 09
title: 000289141
version: EM64L-G09RevD.01
frameworkgroup: C1[X(C16H16N2S)]
method: RPBEPBE
basis: SDD
operation: Freq
keyword: #p
keyword: freq=noraman
keyword: PBEPBE/SDD
title: #p freq=noraman PBEPBE/SDD
converged: YES YES NO NO
title: Mulliken charges:
elementType: S N N C C C C C C C C C C C C C C C C H H H H H H H H H H H H H H H H
charge: 0.194675 -0.042053 -0.461832 -0.442194 0.087642 0.412152 -0.724120 -0.383033 -0.348999 -0.266518 -0.244211 -0.236503 0.491810 -0.571329 0.506654 -0.390248 -0.465394 -0.177999 -0.812732 0.208147 0.252370 0.276849 0.259719 0.262746 0.244464 0.228308 0.230171 0.291543 0.215659 0.269206 0.230541 0.221339 0.226159 0.229441 0.227571
chargesum: 0.00000
title: Mulliken charges with hydrogens summed into heavy atoms:
elementType: S N N C C C C C C C C C C C C C C C C
charge: 0.194675 -0.042053 -0.170289 0.018323 0.087642 0.412152 -0.187553 -0.383033 -0.086252 -0.022054 -0.015902 -0.006332 0.491810 -0.355670 0.506654 -0.121042 -0.234853 0.043340 -0.129561
polarizability: 3.88370140e+02 1.24601919e+01 2.29056567e+02 -7.20849361e+00 6.83825387e-02 9.80252799e+01
1716.lowfreq: -34.4160 -2.3804 -0.0020 -0.0015 -0.0001 6.6532 7.5096 24.7356 34.0989
frequency: -34.4052 24.6384 34.0603 54.3066 86.8921 111.4664 155.3468 177.1268 196.8764 210.9704 235.7104 249.6692 304.4945 321.4322 357.9330 374.2499 397.5094 438.2493 438.6584 467.5513 475.4904 513.2555 525.3854 551.5575 554.7921 569.9968 589.4984 647.1114 653.3251 682.9893 698.9070 730.5488 738.8135 764.2682 792.6258 806.3362 850.7897 862.1950 874.4152 899.2442 920.2328 955.9596 975.9901 982.4211 982.8898 988.1506 996.0073 1010.2222 1028.9355 1048.0884 1050.7631 1085.2703 1090.0907 1120.9982 1135.6141 1159.3869 1170.8297 1174.1062 1187.5012 1211.0840 1253.8066 1288.2874 1300.0406 1303.5271 1329.6865 1343.8171 1370.5939 1384.7958 1396.7532 1411.8174 1423.7998 1440.9795 1444.9999 1459.4501 1471.4111 1475.2781 1491.1779 1510.5774 1544.0683 1564.6669 1598.9217 1604.3933 1620.7397 2914.6639 2976.2094 2977.1036 3034.5781 3054.0026 3085.5007 3096.1416 3109.9320 3126.1003 3129.6344 3141.4424 3148.7142 3157.8938 3170.7099 3186.6131 3434.2273
redmass: 1.0254 4.4277 4.7953 4.9560 4.2664 4.0803 3.9728 4.3377 5.5881 3.0607 3.3026 3.2261 3.8767 4.1129 5.5966 4.4891 4.0397 2.6604 2.4136 3.1539 4.1249 5.0607 2.8475 2.6977 4.2849 3.6617 3.6506 6.2246 4.8704 6.6204 2.0553 4.0138 4.1979 1.3789 1.4126 5.2384 1.8162 1.4110 1.3828 1.4104 2.8861 1.3833 1.9258 1.7595 2.3912 1.3722 1.8644 2.6165 4.2425 1.5542 2.3605 2.3651 1.5376 2.1377 2.3304 1.1431 1.0637 1.0950 1.8123 1.3280 1.5507 2.4053 1.3917 1.3518 2.1534 1.6786 6.2504 5.4461 1.2631 2.2763 2.2783 1.1416 1.1101 2.3882 1.0481 1.2698 2.3455 2.9683 3.1459 6.7306 6.4183 5.5913 5.9143 1.0627 1.0373 1.0939 1.0591 1.0976 1.0985 1.0908 1.1072 1.0869 1.0852 1.0903 1.0954 1.0951 1.0989 1.0947 1.0740
irintensity: 0.3460 0.5895 0.2074 0.2612 5.7236 2.0258 0.9276 3.5291 2.0245 1.0858 1.3349 4.7570 2.0111 2.6349 7.1948 1.2974 5.5245 13.5579 6.0221 25.1823 12.1290 2.3293 14.5131 16.7822 4.1132 5.0560 4.5718 2.7030 1.9038 3.1904 23.3454 12.0162 11.5104 78.1826 55.3886 37.8163 4.3666 15.4241 0.6304 5.5867 2.0809 2.5351 11.4444 1.5994 1.1558 4.2748 17.6210 5.7178 25.6033 13.9864 9.1756 4.9666 9.2482 48.9677 83.6495 0.4272 0.0992 6.8059 70.7680 2.6621 12.8620 100.0684 3.1317 19.8393 11.5875 26.8031 5.7770 17.2831 9.9178 2.1167 41.2404 25.4283 17.9716 44.9989 13.5178 1.5348 151.8219 44.3610 261.2504 13.3478 10.4635 59.6460 217.7925 22.0796 46.8075 11.1746 35.7829 22.6036 17.9747 22.9081 11.2306 6.3735 0.1488 9.8095 31.7798 22.1807 22.8651 3.6216 0.3670
temp: 298.150 k
press: 1.00000 atm
elementType: 16 7 7 6 6 6 6 6 6 6 6 6 6 6 6 6 6 6 6 1 1 1 1 1 1 1 1 1 1 1 1 1 1 1 1
symmnumber: 1
zpe: 732535.0 jmol-1
zpe.correction: 0.279008 hartree
zpe.thermalcorrener: 0.295173 hartree
zpe.thermalcorrenthalpy: 0.296117 hartree
zpe.thermalcorrgfe: 0.234087 hartree
zpe.sumelectzpe: -1125.504014 hartree
zpe.sumelectthermal: -1125.487849 hartree
zpe.sumelectthermalent: -1125.486904 hartree
zpe.sumelectthermalfe: -1125.548934 hartree
dipole: -1.3925 -2.2280 1.1587
dipole: 2.8715
quadrupole: -113.4917 -103.3704 -125.9684
quadrupole: 6.9671 1.9256 -2.4349
quadrupole: 0.7851 10.9064 -11.6915 6.9671 1.9256 -2.4349
hfenergy: -1125.7830214 hartree
pointgroup: C01 [X(C16H16N2S1)]
dipole: 0.6145719 -0.8752712 -0.3640389 debye
polarizability: 389.37363|-0.8179919|226.5118935|-6.3830878|-14.2462447|99.5664638 unknown
InChI: InChI=1S/C16H16N2S/c1-12-5-4-6-13(11-12)17-18-15-9-10-19-16-8-3-2-7-14(15)16/h2-8,11,17H,9-10H2,1H3
charge 0 multiplicity 1
35 atoms
S  -3.823686 -2.16684 0.805516
N  0.048045 -0.017862 -0.038787
N  1.240054 -0.68807 0.030603
C  -1.11377 -2.229748 0.023817
C  -1.092386 -0.703668 -0.048363
C  -2.338493 0.09957 -0.105085
C  -2.469344 -2.867624 -0.303307
C  -3.614494 -0.422411 0.268155
C  -2.279535 1.469554 -0.502563
C  -4.766256 0.399292 0.265907
C  -3.421108 2.289197 -0.498021
C  -4.673971 1.756379 -0.104788
C  2.464409 0.01861 0.047993
C  3.672105 -0.723583 0.107753
C  4.927991 -0.070982 0.12873
C  2.502562 1.437196 0.009064
C  4.959469 1.346005 0.086841
C  3.753006 2.08396 0.028559
C  6.212233 -0.881423 0.197132
H  -0.370489 -2.638922 -0.699189
H  -0.790866 -2.5576 1.035331
H  -2.764796 -2.678927 -1.348865
H  -2.45735 -3.953727 -0.117982
H  -1.305027 1.868322 -0.798743
H  -5.733111 -0.032839 0.545544
H  -3.340703 3.337631 -0.804957
H  -5.571255 2.384636 -0.103516
H  1.281404 -1.71256 0.092687
H  3.635463 -1.822063 0.137383
H  1.564688 1.995486 -0.029594
H  5.923178 1.867583 0.101421
H  3.789068 3.179068 -0.000279
H  7.09998 -0.226824 0.169951
H  6.263308 -1.478243 1.12754
H  6.289379 -1.589473 -0.64939
